Cyclohexane, 1,2,3-trimethyl-
- Formula: C9H18
- Molecular weight: 126.2392
- IUPAC Standard InChIKey: DQTVJLHNWPRPPH-UHFFFAOYSA-N
- CAS Registry Number: 1678-97-3
- Chemical structure:
View 3d structure (requires JavaScript / HTML 5) - Stereoisomers:
- Other names: 1,2,3-Trimethylcyclohexane

Phase change data

Data compiled by: Thermodynamics Research Center, NIST Boulder Laboratories, Chris Muzny director
Quantity | Value | Units | Method | Reference | Comment |
---|---|---|---|---|---|
Tboil | 424.25 | K | N/A | Smith and Pennekamp, 1945 | Uncertainty assigned by TRC = 1. K |

References

Smith and Pennekamp, 1945
Smith, H.A.; Pennekamp, E.F.H.,
The Catalytic Hydrogenation of the Benzene Nucleus III. The Hydrogenation of Polymethylbenzenes,
J. Am. Chem. Soc., 1945, 67, 279. [all data]