Cyclohexane, 1,2,4-trimethyl-, (1α,2α,4α)-
- Formula: C9H18
- Molecular weight: 126.2392
- IUPAC Standard InChIKey: VCJPCEVERINRSG-HRDYMLBCSA-N
- CAS Registry Number: 1678-80-4
- Chemical structure:
View 3d structure (requires JavaScript / HTML 5) - Stereoisomers:
- Cyclohexane, 1,2,4-trimethyl-
- Cyclohexane, 1,2,4-trimethyl-, (1α,2α,4β)-
- Cyclohexane, 1,2,4-trimethyl-, (1α,2β,4α)-
- Cyclohexane, 1,2,4-trimethyl-, (1α,2β,4β)-
- cis, trans, cis-1,2,4-Trimethylcyclohexane
- 1,2,4-Trimethylcyclohexane, cis,trans,trans
- 1-cis-2-trans-4-Trimethylcyclohexane
- 1,2,5-trimethylcyclohexane
- Other names: Cyclohexane, 1,2,4-trimethyl-, cis; cis-1,2,4-Trimethylcyclohexane; cis,cis-1,2,4-Trimethylcyclohexane; cis-1,2,cis-1,4-1,2,4-trimethylcyclohexane

Phase change data

Data compiled by: Thermodynamics Research Center, NIST Boulder Laboratories, Chris Muzny director
Quantity | Value | Units | Method | Reference | Comment |
---|---|---|---|---|---|
Tboil | 420.9 | K | N/A | Chiurdoglu, Fierens, et al., 1950 | Uncertainty assigned by TRC = 1.5 K |
Tboil | 416.15 | K | N/A | Kazanskii and Eliseeva, 1936 | Uncertainty assigned by TRC = 2. K |
Tboil | 409.9 | K | N/A | Zelinskii, 1923 | Uncertainty assigned by TRC = 5. K |
Tboil | 419. | K | N/A | Skita and Schneck, 1922 | Uncertainty assigned by TRC = 3. K |
Tboil | 418.45 | K | N/A | Skita, 1920 | Uncertainty assigned by TRC = 1.5 K |

Kovats' RI, non-polar column, isothermal

Column type | Active phase | Temperature (C) | I | Reference | Comment |
---|---|---|---|---|---|
Capillary | Squalane | 50. | 881.7 | Lunskii and Paizanskaya, 1988 | He; Column length: 50. m; Column diameter: 0.22 mm |
Capillary | Squalane | 70. | 888. | Lunskii and Paizanskaya, 1988 | He; Column length: 50. m; Column diameter: 0.22 mm |
Capillary | Squalane | 100. | 891. | Lulova, Leont'eva, et al., 1976 | He; Column length: 120. m; Column diameter: 0.25 mm |
Capillary | Squalane | 100. | 891. | Lulova, Leont'eva, et al., 1976 | He; Column length: 120. m; Column diameter: 0.25 mm |
Capillary | Vacuum Grease Oil (VM-4) | 35. | 880. | Sidorov, Petrova, et al., 1972 | |
Capillary | Vacuum Grease Oil (VM-4) | 45. | 884. | Sidorov, Petrova, et al., 1972 | |
Capillary | Vacuum Grease Oil (VM-4) | 50. | 886. | Sidorov, Petrova, et al., 1972 | |
Capillary | Vacuum Grease Oil (VM-4) | 58. | 889. | Sidorov, Petrova, et al., 1972 | |
Capillary | Vacuum Grease Oil (VM-4) | 68. | 893. | Sidorov, Petrova, et al., 1972 | |
Packed | Vacuum Grease Oil (VM-4) | 35. | 880. | Sidorov, Ivanova, et al., 1971 | |
Packed | SE-30 | 130. | 895. | Mitra and Saha, 1970 | N2 |
Packed | Methyl Silicone | 130. | 895. | Antheaume and Guiochon, 1965 |

Van Den Dool and Kratz RI, non-polar column, temperature ramp

Column type | Active phase | I | Reference | Comment |
---|---|---|---|---|
Capillary | Petrocol DH | 877.1 | Censullo, Jones, et al., 2003 | 50. m/0.25 mm/0.5 μm, He, 35. C @ 10. min, 3. K/min, 200. C @ 10. min |
Capillary | OV-101 | 877.7 | Yin, Liu, et al., 2001 | N2, 1. K/min; Column length: 80. m; Column diameter: 0.22 mm; Tstart: 30. C; Tend: 130. C |

Normal alkane RI, non-polar column, temperature ramp

Column type | Active phase | I | Reference | Comment |
---|---|---|---|---|
Capillary | Polydimethyl siloxane: CP-Sil 5 CB | 887. | Bramston-Cook, 2013 | 60. m/0.25 mm/1.0 μm, Helium, 45. C @ 1.45 min, 3.6 K/min, 210. C @ 2.72 min |

References

Chiurdoglu, Fierens, et al., 1950
Chiurdoglu, G.; Fierens, P.J.C.; Henkert, C.,
Equilibrium Isomerization of Cyclic Hydrocarbons II. Isomerization by Aluminum Chloride of Cyclophentane and Cyclohexane Hydrocarbons, C9H18,
Bull. Soc. Chim. Belg., 1950, 59, 156. [all data]
Kazanskii and Eliseeva, 1936
Kazanskii, B.A.; Eliseeva, M.P.,
Zh. Obshch. Khim., 1936, 6, 888. [all data]
Zelinskii, 1923
Zelinskii, N.D.,
Ber. Dtsch. Chem. Ges., 1923, 56, 1718. [all data]
Skita and Schneck, 1922
Skita, A.; Schneck, A.,
Stereoismerism in Cyclic Hydrocarbons,
Chem. Ber., 1922, 55, 144-52. [all data]
Skita, 1920
Skita, A.,
Chem. Ber., 1920, 53, 1792. [all data]
Lunskii and Paizanskaya, 1988
Lunskii, M.Kh.; Paizanskaya, I.L.,
Identification of hydrocarbons C1-C9 of petrol fractions of oils and condensates in the use of capillary columns with dinonylphthalate,
Zh. Anal. Khim., 1988, 43, 127-135. [all data]
Lulova, Leont'eva, et al., 1976
Lulova, N.I.; Leont'eva, S.A.; Timofeeva, A.N.,
Gas-chromatographic method of determination of individual hydrocarbons in catalytic cracking gasolines
in Proceedings of All-Union Research Institute on Oil Processes. Vol.18, All-Union Research Institute on Oil Processes, Moscow, 1976, 30-53. [all data]
Sidorov, Petrova, et al., 1972
Sidorov, R.I.; Petrova, V.I.; Ivanova, M.P.,
Qualitative analysis of wide-boiling fraction C5-C10 with capillary chromatography
in Processes in chromatographic columns. Vol.17, 1972, 14-25. [all data]
Sidorov, Ivanova, et al., 1971
Sidorov, R.I.; Ivanova, M.P.; Petrova, V.I.,
Temperature dependence of cycloalkane's retention and its using in identification of structure,
Gazovaya Khromatografiya, 1971, 15, 18-26. [all data]
Mitra and Saha, 1970
Mitra, G.D.; Saha, N.C.,
Determination of Retention Indices of Saturated Hydrocarbons by Graphical Methods,
J. Chromatogr. Sci., 1970, 8, 2, 95-102, https://doi.org/10.1093/chromsci/8.2.95
. [all data]
Antheaume and Guiochon, 1965
Antheaume, J.; Guiochon, G.,
Application de la chromatographie en phase gazeuse à l'étude de la composition des fractions moyennes d'un brut pétrolier,
Bull. Soc. Chim. Fr., 1965, 2, 298-307. [all data]
Censullo, Jones, et al., 2003
Censullo, A.C.; Jones, D.R.; Wills, M.T.,
Speciation of the volatile organic compounds (VOCs) in solventborne aerosol coatings by solid phase microextraction-gas chromatography,
J. Coat. Technol., 2003, 75, 936, 47-53, https://doi.org/10.1007/BF02697922
. [all data]
Yin, Liu, et al., 2001
Yin, C.; Liu, W.; Li, Z.; Pan, Z.; Lin, T.; Zhang, M.,
Chemometrics to chemical modeling: structural coding in hydrocarbons and retention indices of gas chromatography,
J. Sep. Sci., 2001, 24, 3, 213-220, https://doi.org/10.1002/1615-9314(20010301)24:3<213::AID-JSSC213>3.0.CO;2-4
. [all data]
Bramston-Cook, 2013
Bramston-Cook, R.,
Kovats indices for C2-C13 hydrocarbons and selected oxygenated/halocarbons with 100 % dimethylpolysiloxane columns, 2013, retrieved from http://lotusinstruments.com/monographs/List .... [all data]