1H-Inden-1-one, octahydro-, trans-
- Formula: C9H14O
- Molecular weight: 138.2069
- IUPAC Standard InChIKey: ATKSQUYIHKMKTG-SFYZADRCSA-N
- CAS Registry Number: 16783-22-5
- Chemical structure:
View 3d structure (requires JavaScript / HTML 5) - Stereoisomers:
- Other names: 1-Indanone, hexahydro-, trans-; Octahydro-1H-inden-1-one, (E)-

Condensed phase thermochemistry data

Data compiled by: Hussein Y. Afeefy, Joel F. Liebman, and Stephen E. Stein
Quantity | Value | Units | Method | Reference | Comment |
---|---|---|---|---|---|
ΔcH°liquid | -5193.6 | kJ/mol | Ccb | Huckel and Friedrich, 1926 | Corresponding ΔfHºliquid = -349. kJ/mol (simple calculation by NIST; no Washburn corrections) |

References

Huckel and Friedrich, 1926
Huckel, W.; Friedrich, H.,
Zur Stereochemie bicyclischer Ringsytem III: Die Stereoisomerie des Hydrindans und seiner Derivate I,
Ann., 1926, 451, 132-160. [all data]