1,2-Dimethoxy-4-chloro-benzene
- Formula: C8H9ClO2
- Molecular weight: 172.609
- IUPAC Standard InChIKey: RXJCXGJKJZARAW-UHFFFAOYSA-N
- CAS Registry Number: 16766-27-1
- Chemical structure:
View 3d structure (requires JavaScript / HTML 5) - Other names: 4-Chloroveratrole; 4-Chloro-1,2-dimethoxybenzene; 4-Chloro-2-methoxyphenol, methyl ether; Benzene, 4-chloro-1,2-dimethoxy

Kovats' RI, non-polar column, isothermal

Column type | Active phase | Temperature (C) | I | Reference | Comment |
---|---|---|---|---|---|
Capillary | SE-30 | 140. | 1307. | Korhonen, Knuutinen, et al., 1984 | Column length: 25. m; Column diameter: 0.30 mm |
Capillary | SE-30 | 160. | 1301. | Korhonen, Knuutinen, et al., 1984 | Column length: 25. m; Column diameter: 0.30 mm |
Capillary | SE-30 | 180. | 1300. | Korhonen, Knuutinen, et al., 1984 | Column length: 25. m; Column diameter: 0.30 mm |
Capillary | SE-30 | 200. | 1318. | Korhonen, Knuutinen, et al., 1984 | Column length: 25. m; Column diameter: 0.30 mm |

Kovats' RI, polar column, isothermal

Column type | Active phase | Temperature (C) | I | Reference | Comment |
---|---|---|---|---|---|
Capillary | OV-351 | 140. | 1951. | Korhonen, Knuutinen, et al., 1984 | Column length: 25. m; Column diameter: 0.32 mm |
Capillary | OV-351 | 160. | 1959. | Korhonen, Knuutinen, et al., 1984 | Column length: 25. m; Column diameter: 0.32 mm |
Capillary | OV-351 | 180. | 1975. | Korhonen, Knuutinen, et al., 1984 | Column length: 25. m; Column diameter: 0.32 mm |
Capillary | OV-351 | 200. | 1994. | Korhonen, Knuutinen, et al., 1984 | Column length: 25. m; Column diameter: 0.32 mm |

Van Den Dool and Kratz RI, non-polar column, temperature ramp

Column type | Active phase | I | Reference | Comment |
---|---|---|---|---|
Capillary | SE-30 | 1307. | Korhonen, Knuutinen, et al., 1984 | 6. K/min; Column length: 25. m; Column diameter: 0.30 mm; Tstart: 100. C |

Van Den Dool and Kratz RI, non-polar column, custom temperature program

Column type | Active phase | I | Reference | Comment |
---|---|---|---|---|
Capillary | VF-5MS | 1335.3 | Tret'yakov, 2008 | 30. m/0.25 mm/0.25 μm, He; Program: Multi-step temperature program; T(initial)=60C; T(final)=270C |

Van Den Dool and Kratz RI, polar column, temperature ramp

Column type | Active phase | I | Reference | Comment |
---|---|---|---|---|
Capillary | OV-351 | 1959. | Korhonen, Knuutinen, et al., 1984 | 6. K/min; Column length: 25. m; Column diameter: 0.32 mm; Tstart: 100. C |

References

Korhonen, Knuutinen, et al., 1984
Korhonen, I.O.O.; Knuutinen, J.; Jaaskelainen, R.,
Gas-Liquid Chromatographic Analyses. XXIV. Capillary Column Studies of the Chlorinated Veratroles (1,2-Dimethoxybenzenes),
J. Chromatogr., 1984, 287, 293-303, https://doi.org/10.1016/S0021-9673(01)87704-9
. [all data]
Tret'yakov, 2008
Tret'yakov, K.V.,
Retention Data. NIST Mass Spectrometry Data Center., NIST Mass Spectrometry Data Center, 2008. [all data]