Diethynyldiphenylgermane
- Formula: C16H12Ge
- Molecular weight: 276.91
- IUPAC Standard InChIKey: KKMYEVIOFAXXRB-UHFFFAOYSA-N
- CAS Registry Number: 1675-59-8
- Chemical structure:
View 3d structure (requires JavaScript / HTML 5) - Permanent link for this species. Use this link for bookmarking this species for future reference.

Gas phase thermochemistry data

Data compiled by: José A. Martinho Simões
Quantity | Value | Units | Method | Reference | Comment |
---|---|---|---|---|---|
ΔfH°gas | 805.8 | kJ/mol | Review | Martinho Simões |

Condensed phase thermochemistry data

Data compiled as indicated in comments:
MS - José A. Martinho Simões
DH - Eugene S. Domalski and Elizabeth D. Hearing
Quantity | Value | Units | Method | Reference | Comment |
---|---|---|---|---|---|
ΔfH°solid | 671.9 ± 8.9 | kJ/mol | Review | Martinho Simões | MS |
Quantity | Value | Units | Method | Reference | Comment |
ΔcH°solid | -9222.0 ± 8.4 | kJ/mol | CC-SB | Lebedev, Milor, et al., 1975 | Please also see Lebedev, Lebedev, et al., 1979.; MS |
Quantity | Value | Units | Method | Reference | Comment |
S°solid,1 bar | 356.9 | J/mol*K | N/A | Lebedev, Milov, et al., 1975 | DH |
S°solid,1 bar | 358.9 | J/mol*K | N/A | Lebedev, Milov, et al., 1975, 2 | DH |
Constant pressure heat capacity of solid
Cp,solid (J/mol*K) | Temperature (K) | Reference | Comment |
---|---|---|---|
305.4 | 298.15 | Lebedev, Milov, et al., 1975 | T = 8.4 to 326 K. Deposited in VINITI, No 605-75, 10 March 1975.; DH |
307.1 | 300. | Lebedev, Milov, et al., 1975, 2 | T = 8 to 326 K.; DH |

Phase change data

Data compiled as indicated in comments:
TRC - Thermodynamics Research Center, NIST Boulder Laboratories, Chris Muzny director
AC - William E. Acree, Jr., James S. Chickos
MS - José A. Martinho Simões
DH - Eugene S. Domalski and Elizabeth D. Hearing
Quantity | Value | Units | Method | Reference | Comment |
---|---|---|---|---|---|
Ttriple | 319.94 | K | N/A | Lebedev, Milov, et al., 1975 | Uncertainty assigned by TRC = 0.02 K; TRC |
Quantity | Value | Units | Method | Reference | Comment |
ΔsubH° | 133.9 | kJ/mol | CC-SB | Lebedev, Milor, et al., 1975 | The sublimation enthalpy was taken as the sum of melting and vaporization enthalpies.; MS |
Enthalpy of vaporization
ΔvapH (kJ/mol) | Temperature (K) | Method | Reference | Comment |
---|---|---|---|---|
110.8 | 320. | A | Stephenson and Malanowski, 1987 | Based on data from 305. to 337. K.; AC |
Enthalpy of fusion
ΔfusH (kJ/mol) | Temperature (K) | Reference | Comment |
---|---|---|---|
20.100 | 319.94 | Lebedev, Milov, et al., 1975 | DH |
20.100 | 319.94 | Lebedev, Milov, et al., 1975, 2 | DH |
20.1 | 320. | Lebedev, Milov, et al., 1975, 3 | Based on data from 8. to 326. K.; AC |
Entropy of fusion
ΔfusS (J/mol*K) | Temperature (K) | Reference | Comment |
---|---|---|---|
62.80 | 319.94 | Lebedev, Milov, et al., 1975 | DH |
62.80 | 319.94 | Lebedev, Milov, et al., 1975, 2 | DH |

References

Martinho Simões
Martinho Simões, J.A.,
Private communication (see http://webbook.nist.gov/chemistry/om/). [all data]
Lebedev, Milor, et al., 1975
Lebedev, B.V.; Milor, V.I.; Tsvetkova, L.Ya.; Lebedev, N.K.; Kiparisova, E.G.; Evstropov, A.A.,
Thermodynamic properties of diethynyldiphenylgermane,
Russ. J. Phys. Chem. (Engl. Transl.), 1975, 49, 944. [all data]
Lebedev, Lebedev, et al., 1979
Lebedev, N.K.; Lebedev, B.V.; Kiparisova, E.G.; Sladkov, A.M.; Vasneva, N.A.,
Dokl. Akad. Nauk SSSR, 1979, 246, 1405. [all data]
Lebedev, Milov, et al., 1975
Lebedev, B.V.; Milov, V.I.; Tsvetkova, L.Ya.; Lebedev, N.K.; Kiparisova, Y.G.; Evstropov, A.A.,
Thermodynamic properties of diethynyldiphenylgermane,
Zhur. Fiz. Khim., 1975, 49, 1592. [all data]
Lebedev, Milov, et al., 1975, 2
Lebedev, B.V.; Milov, V.I.; Kiparisova, Y.G.; Rabinovich, I.B.,
The thermodynamics of diphenyldiethynylgermane,
Quatrieme Conference International de Thermodynamique Chimique, 1975, II, Thermophysique (capacites thermiques) pp. [all data]
Stephenson and Malanowski, 1987
Stephenson, Richard M.; Malanowski, Stanislaw,
Handbook of the Thermodynamics of Organic Compounds, 1987, https://doi.org/10.1007/978-94-009-3173-2
. [all data]
Lebedev, Milov, et al., 1975, 3
Lebedev, B.V.; Milov, V.I.; Tsvetkova, L.Y.; Lebedev, N.K.; Kirparisova, Y.G.; Evstropov, A.A.,
Zh. Fiz. Khim., 1975, 49, 1591. [all data]