Diphenylgermane
- Formula: C12H12Ge
- Molecular weight: 228.86
- IUPAC Standard InChIKey: RQAOPXAHIPYOBI-UHFFFAOYSA-N
- CAS Registry Number: 1675-58-7
- Chemical structure:
View 3d structure (requires JavaScript / HTML 5) - Permanent link for this species. Use this link for bookmarking this species for future reference.

Condensed phase thermochemistry data

Data compiled as indicated in comments:
MS - José A. Martinho Simões
DH - Eugene S. Domalski and Elizabeth D. Hearing
Quantity | Value | Units | Method | Reference | Comment |
---|---|---|---|---|---|
ΔfH°liquid | 237.9 ± 4.2 | kJ/mol | Review | Martinho Simões | MS |
Quantity | Value | Units | Method | Reference | Comment |
ΔcH°liquid | -7214. ± 3.3 | kJ/mol | CC-SB | Lebedev, Kiparisova, et al., 1980 | MS |
Quantity | Value | Units | Method | Reference | Comment |
S°liquid | 337.9 | J/mol*K | N/A | Lebedev, Lebedev, et al., 1979 | DH |
Constant pressure heat capacity of liquid
Cp,liquid (J/mol*K) | Temperature (K) | Reference | Comment |
---|---|---|---|
287.3 | 298.15 | Lebedev, Lebedev, et al., 1979 | T = 5 to 330 K.; DH |

Phase change data

Data compiled as indicated in comments:
TRC - Thermodynamics Research Center, NIST Boulder Laboratories, Chris Muzny director
DH - Eugene S. Domalski and Elizabeth D. Hearing
AC - William E. Acree, Jr., James S. Chickos
Quantity | Value | Units | Method | Reference | Comment |
---|---|---|---|---|---|
Tfus | 240. | K | N/A | Lebedev, Kiparisova, et al., 1980, 2 | Uncertainty assigned by TRC = 0.1 K; TRC |
Enthalpy of fusion
ΔfusH (kJ/mol) | Temperature (K) | Reference | Comment |
---|---|---|---|
11.910 | 239.44 | Lebedev, Lebedev, et al., 1979 | DH |
11.91 | 240.2 | Lebedev, Kiparisova, et al., 1980, 3 | AC |
Entropy of fusion
ΔfusS (J/mol*K) | Temperature (K) | Reference | Comment |
---|---|---|---|
49.74 | 239.44 | Lebedev, Lebedev, et al., 1979 | DH |

References

Martinho Simões
Martinho Simões, J.A.,
Private communication (see http://webbook.nist.gov/chemistry/om/). [all data]
Lebedev, Kiparisova, et al., 1980
Lebedev, N.K.; Kiparisova, E.G.; Lebedev, B.V.; Sladkov, A.M.; Vasneva, N.A.,
Izv. Akad. Nauk SSSR, Ser. Khim., 1980, 555.. [all data]
Lebedev, Lebedev, et al., 1979
Lebedev, B.V.; Lebedev, N.K.; Kiparisova, E.G.,
Thermodynamics of diphenylgermane in the range 6 to 330 K,
Khimiya Elementoorgan. Soedin (Gor'kii), 1979, (7), 61-65. [all data]
Lebedev, Kiparisova, et al., 1980, 2
Lebedev, N.K.; Kiparisova, E.G.; Lebedev, B.V.; Sladkov, A.M.; Vasmeva, N.A.,
Bull. Acad. Sci. USSR, 1980, Div. Chem. Sci.(English Trans.) 29. [all data]
Lebedev, Kiparisova, et al., 1980, 3
Lebedev, N.K.; Kiparisova, E.G.; Lebedev, B.V.; Sladkov, A.M.; Vasneva, N.A.,
Thermodynamics of polyaddition reactions of silicon and germanium dihydrides with bis(ethynyl) derivatives of silicon and germanium,
Russ Chem Bull, 1980, 29, 3, 374-376, https://doi.org/10.1007/BF00949619
. [all data]