Pentane, 2,2,3,3,4-pentamethyl-

Kovats' RI, non-polar column, isothermal

View large format table.

Column type Active phase Temperature (C) I Reference Comment
CapillarySqualane100.953.Heinzen, Soares, et al., 1999
CapillarySqualane60.953.4Chretien and Dubois, 1976
CapillaryVacuum Grease Oil (VM-4)95.953.1Sultanov and Arustamova, 1975N2; Column length: 150. m; Column diameter: 0.25 mm
PackedSqualane50.949.4Takács, Szita, et al., 1971N2, Chromosorb W; Column length: 3. m
CapillarySqualane60.953.Matukuma, 1969N2; Column length: 91.4 m; Column diameter: 0.25 mm

Kovats' RI, non-polar column, custom temperature program

View large format table.

Column type Active phase I Reference Comment
CapillarySqualane949.Korol and Lysyuk, 1980Program: not specified

Normal alkane RI, non-polar column, custom temperature program

View large format table.

Column type Active phase I Reference Comment
CapillaryOV-101953.Du and Liang, 2003Program: not specified
CapillaryPolydimethyl siloxane953.Junkes, Castanho, et al., 2003Program: not specified

Phase change data

Data compiled as indicated in comments:
TRC - Thermodynamics Research Center, NIST Boulder Laboratories, Chris Muzny director
AC - William E. Acree, Jr., James S. Chickos

Quantity Value Units Method Reference Comment
Tboil439.2KN/AHoward, Mears, et al., 1947Uncertainty assigned by TRC = 0.1 K; TRC
Quantity Value Units Method Reference Comment
Tfus236.66KN/AHoward, Mears, et al., 1947Uncertainty assigned by TRC = 0.1 K; TRC
Quantity Value Units Method Reference Comment
Δvap45.2kJ/molN/AReid, 1972AC

In addition to the Thermodynamics Research Center (TRC) data available from this site, much more physical and chemical property data is available from the following TRC products:

References

Heinzen, Soares, et al., 1999
Heinzen, V.E.F.; Soares, M.F.; Yunes, R.A., Semi-empirical topological method for the prediction of the chromatographic retention of cis- and trans-alkene isomers and alkanes, J. Chromatogr. A, 1999, 849, 2, 495-506, https://doi.org/10.1016/S0021-9673(99)00530-0 . [all data]

Chretien and Dubois, 1976
Chretien, J.R.; Dubois, J.-E., New Perspectives in the Prediction of Kovats Indices, J. Chromatogr., 1976, 126, 171-189, https://doi.org/10.1016/S0021-9673(01)84071-1 . [all data]

Sultanov and Arustamova, 1975
Sultanov, N.T.; Arustamova, L.G., Determination of the boiling points of C10 isoalkanes in an n-decane isomerizate from gas chromatographic retention indices, J. Chromatogr., 1975, 115, 2, 553-558, https://doi.org/10.1016/S0021-9673(01)98959-9 . [all data]

Takács, Szita, et al., 1971
Takács, J.; Szita, C.; Tarján, G., Contribution to the theory of the retention index system. III. Retention index and molecular structure. Calculation of retention indices of paraffin hydrocarbons on the basis of their molecular structure, J. Chromatogr., 1971, 56, 1-12, https://doi.org/10.1016/S0021-9673(00)97771-9 . [all data]

Matukuma, 1969
Matukuma, A., Retention indices of alkanes through C10 and alkenes through C8 and relation between boiling points and retention data, Gas Chromatogr., Int. Symp. Anal. Instrum. Div Instrum Soc. Amer., 1969, 7, 55-75. [all data]

Korol and Lysyuk, 1980
Korol, A.N.; Lysyuk, L.S., A New Thermodynamic Method for Calculating the Retention Indices of Isoalkanes on Squalane, Theor. Exp. Chem. (Engl. Transl.), 1980, 6, 577-584. [all data]

Du and Liang, 2003
Du, Y.; Liang, Y., Data mining for seeking accurate quantitative relationship between molecular structure and GC retention indices of alkanes by projection pursuit, Comput. Biol. Chem., 2003, 27, 3, 339-353, https://doi.org/10.1016/S1476-9271(02)00081-6 . [all data]

Junkes, Castanho, et al., 2003
Junkes, B.S.; Castanho, R.D.M.; Amboni, C.; Yunes, R.A.; Heinzen, V.E.F., Semiempirical Topological Index: A Novel Molecular Descriptor for Quantitative Structure-Retention Relationship Studies, Internet Electronic Journal of Molecular Design, 2003, 2, 1, 33-49. [all data]