Pentane, 2,3,3,4-tetramethyl-
- Formula: C9H20
- Molecular weight: 128.2551
- IUPAC Standard InChIKey: JLCYYQOQSAMWTA-UHFFFAOYSA-N
- CAS Registry Number: 16747-38-9
- Chemical structure:
View 3d structure (requires JavaScript / HTML 5) - Other names: 2,3,3,4-Tetramethylpentane

Condensed phase thermochemistry data

Data compiled by: Hussein Y. Afeefy, Joel F. Liebman, and Stephen E. Stein
Quantity | Value | Units | Method | Reference | Comment |
---|---|---|---|---|---|
ΔcH°liquid | -6121.9 ± 1.6 | kJ/mol | Ccb | Johnson, Prosen, et al., 1947 | Corresponding ΔfHºliquid = -277.9 kJ/mol (simple calculation by NIST; no Washburn corrections) |

Phase change data

Data compiled as indicated in comments:
BS - Robert L. Brown and Stephen E. Stein
TRC - Thermodynamics Research Center, NIST Boulder Laboratories, Chris Muzny director
AC - William E. Acree, Jr., James S. Chickos
Quantity | Value | Units | Method | Reference | Comment |
---|---|---|---|---|---|
Tboil | 413. ± 6. | K | AVG | N/A | Average of 8 values; Individual data points |
Quantity | Value | Units | Method | Reference | Comment |
Tfus | 171.01 | K | N/A | Howard, Mears, et al., 1947 | Uncertainty assigned by TRC = 0.1 K; TRC |
Tfus | 171.02 | K | N/A | Streiff, Murphy, et al., 1947 | Uncertainty assigned by TRC = 0.02 K; TRC |
Tfus | 171.02 | K | N/A | Streiff, Murphy, et al., 1946 | Uncertainty assigned by TRC = 0.05 K; TRC |
Quantity | Value | Units | Method | Reference | Comment |
Tc | 607.5 ± 0.5 | K | N/A | Daubert, 1996 | |
Tc | 607.55 | K | N/A | Ambrose and Townsend, 1968 | Uncertainty assigned by TRC = 0.2 K; extrapolated back to zero time to correct for decomposition; TRC |
Quantity | Value | Units | Method | Reference | Comment |
Pc | 27.2 ± 0.4 | bar | N/A | Daubert, 1996 | |
Pc | 27.16 | bar | N/A | Ambrose and Townsend, 1968 | Uncertainty assigned by TRC = 0.20 bar; TRC |
Quantity | Value | Units | Method | Reference | Comment |
ΔvapH° | 41.8 | kJ/mol | N/A | Reid, 1972 | See also Labbauf, Greenshields, et al., 1961.; AC |
Enthalpy of vaporization
ΔvapH (kJ/mol) | Temperature (K) | Method | Reference | Comment |
---|---|---|---|---|
39.3 | 346. | A | Stephenson and Malanowski, 1987 | Based on data from 331. to 416. K. See also Forziati, Norris, et al., 1949.; AC |
Antoine Equation Parameters
log10(P) = A − (B / (T + C))
P = vapor pressure (bar)
T = temperature (K)
View plot Requires a JavaScript / HTML 5 canvas capable browser.
Temperature (K) | A | B | C | Reference | Comment |
---|---|---|---|---|---|
332.16 to 415.72 | 3.99656 | 1425.254 | -57.568 | Forziati, Norris, et al., 1949, 2 | Coefficents calculated by NIST from author's data. |

Henry's Law data

Data compiled by: Rolf Sander
Henry's Law constant (water solution)
kH(T) = k°H exp(d(ln(kH))/d(1/T) ((1/T) - 1/(298.15 K)))
k°H = Henry's law constant for solubility in water at 298.15 K (mol/(kg*bar))
d(ln(kH))/d(1/T) = Temperature dependence constant (K)
k°H (mol/(kg*bar)) | d(ln(kH))/d(1/T) (K) | Method | Reference | Comment |
---|---|---|---|---|
0.00016 | Q | N/A | missing citation give several references for the Henry's law constants but don't assign them to specific species. |

Kovats' RI, non-polar column, isothermal

View large format table.

Column type Active phase Temperature (C) I Reference Comment
CapillarySqualane100.861.Heinzen, Soares, et al., 1999
CapillarySqualane25.852.Hilal, Carreira, et al., 1994
CapillarySqualane50.857.9Lunskii and Paizanskaya, 1988He; Column length: 50. m; Column diameter: 0.22 mm
CapillarySqualane70.864.2Lunskii and Paizanskaya, 1988He; Column length: 50. m; Column diameter: 0.22 mm
CapillaryDB-160.854.5Lubeck and Sutton, 1983Column length: 60. m; Column diameter: 0.264 mm
CapillaryDB-160.854.7Lubeck and Sutton, 198360. m/0.259 mm/1. μm
CapillarySqualane60.861.Chretien and Dubois, 1976
CapillarySqualane60.861.1Chretien and Dubois, 1976
CapillaryVacuum Grease Oil (VM-4)95.860.9Sultanov and Arustamova, 1975N2; Column length: 150. m; Column diameter: 0.25 mm
CapillarySqualane50.858.Rijks and Cramers, 1974N2; Column length: 100. m; Column diameter: 0.25 mm
CapillarySqualane70.863.Rijks and Cramers, 1974N2; Column length: 100. m; Column diameter: 0.25 mm
CapillarySqualane70.858.9Dimov and Schopov, 1971Column length: 100. m; Column diameter: 0.25 mm
CapillarySqualane60.861.Matukuma, 1969N2; Column length: 91.4 m; Column diameter: 0.25 mm
CapillarySqualane30.854.Tourres, 1967H2; Column length: 100. m; Column diameter: 0.25 mm
CapillarySqualane50.859.Tourres, 1967H2; Column length: 100. m; Column diameter: 0.25 mm
CapillarySqualane70.865.Tourres, 1967H2; Column length: 100. m; Column diameter: 0.25 mm

Kovats' RI, non-polar column, temperature ramp

View large format table.

Column type Active phase I Reference Comment
CapillaryApiezon L870.Louis, 1971N2, 1. K/min; Column length: 50. m; Column diameter: 0.25 mm; Tstart: 60. C

Van Den Dool and Kratz RI, non-polar column, temperature ramp

View large format table.

Column type Active phase I Reference Comment
CapillaryPetrocol DH851.White, Hackett, et al., 1992100. m/0.25 mm/0.5 μm, He, 1. K/min; Tstart: 30. C; Tend: 220. C

Normal alkane RI, non-polar column, temperature ramp

View large format table.

Column type Active phase I Reference Comment
CapillaryPetrocol DH856.Supelco, 2012100. m/0.25 mm/0.50 μm, Helium, 20. C @ 15. min, 15. K/min, 220. C @ 30. min

Normal alkane RI, non-polar column, custom temperature program

View large format table.

Column type Active phase I Reference Comment
CapillaryMethyl Silicone858.Feng and Mu, 2007Program: not specified
CapillaryOV-101861.Du and Liang, 2003Program: not specified
CapillaryPolydimethyl siloxane861.Junkes, Castanho, et al., 2003Program: not specified

References

Johnson, Prosen, et al., 1947
Johnson, W.H.; Prosen, E.J.; Rossini, F.D.,
Heats of combustion and isomerization of six nonanes,
J. Res. NBS, 1947, 38, 419-422. [all data]
Howard, Mears, et al., 1947
Howard, F.L.; Mears, T.W.; Fookson, A.; Pomerantz, P.; Brooks, D.B.,
Preparation and physical properties of several aliphatic hydrocarbons and intermediates,
J. Res. Natl. Bur. Stand. (U. S.), 1947, 38, 365. [all data]
Streiff, Murphy, et al., 1947
Streiff, A.J.; Murphy, E.T.; Cahill, J.C.; Flanagan, H.F.; Sedlak, V.A.; Willingham, C.B.; Rossini, F.D.,
Purification, Purity, and Freezing Points of 8 Nonanes, 11 Alkyl- cyclopentanes, 6 Alkylcyclohexanes, and 4 Butylbenzenes of the API-NBS Series,
J. Res. Natl. Bur. Stand. (U. S.), 1947, 38, 53. [all data]
Streiff, Murphy, et al., 1946
Streiff, A.J.; Murphy, E.T.; Cahill, J.C.; Soule, L.F.; Sedlak, V.A.; Willingham, C.B.; Rossini, F.D.,
, Am. Pet. Inst. Res. Proj. 6, unpublished, Natl. Bur. Stand., 1946. [all data]
Daubert, 1996
Daubert, T.E.,
Vapor-Liquid Critical Properties of Elements and Compounds. 5. Branched Alkanes and Cycloalkanes,
J. Chem. Eng. Data, 1996, 41, 365-372. [all data]
Ambrose and Townsend, 1968
Ambrose, D.; Townsend, R.,
Critical Temperatures and Pressures of Some Alkanes,
Trans. Faraday Soc., 1968, 64, 2622. [all data]
Reid, 1972
Reid, Robert C.,
Handbook on vapor pressure and heats of vaporization of hydrocarbons and related compounds, R. C. Wilhort and B. J. Zwolinski, Texas A Research Foundation. College Station, Texas(1971). 329 pages.$10.00,
AIChE J., 1972, 18, 6, 1278-1278, https://doi.org/10.1002/aic.690180637
. [all data]
Labbauf, Greenshields, et al., 1961
Labbauf, A.; Greenshields, J.B.; Rossini, F.D.,
Heats of formation, combustion, and vaporization of the 35 nonanes and 75 decanes,
J. Chem. Eng. Data, 1961, 6, 261-263. [all data]
Stephenson and Malanowski, 1987
Stephenson, Richard M.; Malanowski, Stanislaw,
Handbook of the Thermodynamics of Organic Compounds, 1987, https://doi.org/10.1007/978-94-009-3173-2
. [all data]
Forziati, Norris, et al., 1949
Forziati, Alphonse F.; Norris, William R.; Rossini, Frederick D.,
Vapor pressures and boiling points of sixty API-NBS hydrocarbons,
J. RES. NATL. BUR. STAN., 1949, 43, 6, 555-17, https://doi.org/10.6028/jres.043.050
. [all data]
Forziati, Norris, et al., 1949, 2
Forziati, A.F.; Norris, W.R.; Rossini, F.D.,
Vapor Pressures and Boiling Points of Sixty API-NBS Hydrocarbons,
J. Res. Natl. Bur. Stand. (U.S.), 1949, 43, 6, 555-563, https://doi.org/10.6028/jres.043.050
. [all data]