Hexane, 2,3,3-trimethyl-
- Formula: C9H20
- Molecular weight: 128.2551
- IUPAC Standard InChIKey: DJYSEQMMCZAKGT-UHFFFAOYSA-N
- CAS Registry Number: 16747-28-7
- Chemical structure:
View 3d structure (requires JavaScript / HTML 5) - Other names: 2,3,3-Trimethylhexane; 2,3,3-Trimethylheptane

Condensed phase thermochemistry data

Data compiled by: Hussein Y. Afeefy, Joel F. Liebman, and Stephen E. Stein
Quantity | Value | Units | Method | Reference | Comment |
---|---|---|---|---|---|
ΔfH°liquid | -281.1 ± 1.0 | kJ/mol | Ccr | Good, 1969 | |
Quantity | Value | Units | Method | Reference | Comment |
ΔcH°liquid | -6118.81 ± 0.84 | kJ/mol | Ccr | Good, 1969 | Corresponding ΔfHºliquid = -281.1 kJ/mol (simple calculation by NIST; no Washburn corrections) |

Phase change data

Data compiled as indicated in comments:
BS - Robert L. Brown and Stephen E. Stein
TRC - Thermodynamics Research Center, NIST Boulder Laboratories, Chris Muzny director
AC - William E. Acree, Jr., James S. Chickos
Quantity | Value | Units | Method | Reference | Comment |
---|---|---|---|---|---|
Tboil | 410.9 | K | N/A | Weast and Grasselli, 1989 | BS |
Tboil | 409.45 | K | N/A | Levina, Tantsyreva, et al., 1952 | Uncertainty assigned by TRC = 0.5 K; TRC |
Tboil | 409.95 | K | N/A | Buck, Elsner, et al., 1948 | Uncertainty assigned by TRC = 0.4 K; TRC |
Tboil | 410.75 | K | N/A | Cline, 1939 | Uncertainty assigned by TRC = 1. K; TRC |
Quantity | Value | Units | Method | Reference | Comment |
Tfus | 156.35 | K | N/A | Streiff, Zimmerman, et al., 1948 | Uncertainty assigned by TRC = 0.05 K; TRC |
Quantity | Value | Units | Method | Reference | Comment |
ΔvapH° | 42.1 | kJ/mol | N/A | Reid, 1972 | See also Labbauf, Greenshields, et al., 1961.; AC |
Enthalpy of vaporization
ΔvapH (kJ/mol) | Temperature (K) | Method | Reference | Comment |
---|---|---|---|---|
44.2 | 253. | A | Stephenson and Malanowski, 1987 | Based on data from 238. to 303. K.; AC |
39.4 | 303. | A | Stephenson and Malanowski, 1987 | Based on data from 288. to 422. K.; AC |

Henry's Law data

Data compiled by: Rolf Sander
Henry's Law constant (water solution)
kH(T) = k°H exp(d(ln(kH))/d(1/T) ((1/T) - 1/(298.15 K)))
k°H = Henry's law constant for solubility in water at 298.15 K (mol/(kg*bar))
d(ln(kH))/d(1/T) = Temperature dependence constant (K)
k°H (mol/(kg*bar)) | d(ln(kH))/d(1/T) (K) | Method | Reference | Comment |
---|---|---|---|---|
0.00017 | Q | N/A | missing citation give several references for the Henry's law constants but don't assign them to specific species. |

Normal alkane RI, non-polar column, custom temperature program

Data compiled by: NIST Mass Spectrometry Data Center, William E. Wallace, director

Column type CapillaryCapillaryCapillary
Active phase OV-101Polydimethyl siloxanePolydimethyl siloxanes
Column length (m)
Carrier gas
Substrate
Column diameter (mm)
Phase thickness (μm)
Program not specifiednot specifiednot specified
I 842.842.840.
ReferenceDu and Liang, 2003Junkes, Castanho, et al., 2003Yin, Guo, et al., 2001
Comment MSDC-RI MSDC-RI MSDC-RI

References

Good, 1969
Good, W.D.,
Enthalpies of combustion and formation of 11 isomeric nonanes,
J. Chem. Eng. Data, 1969, 14, 231-235. [all data]
Weast and Grasselli, 1989
CRC Handbook of Data on Organic Compounds, 2nd Editon, Weast,R.C and Grasselli, J.G., ed(s)., CRC Press, Inc., Boca Raton, FL, 1989, 1. [all data]
Levina, Tantsyreva, et al., 1952
Levina, R.Ya.; Tantsyreva, T.I.; Fainzil'berg, A.A.,
Synthesis of Hydrocarbons XX. Synthesis of Alkenes and Alkanes with A Quarternary Carbon Atom,
Zh. Obshch. Khim., 1952, 22, 571. [all data]
Buck, Elsner, et al., 1948
Buck, F.R.; Elsner, B.B.; Forbes, E.J.; Morrell, S.H.; Smith, J.C.; Wallsgrove, E.R.,
The Use of Zinc Alkyls in the Preparation of Hydrocarbons with a Quaternary Carbon Atom,
J. Inst. Pet., 1948, 34, 339. [all data]
Cline, 1939
Cline, E.T.,
The Synthesis of Type III and Type V Olefins from Dimethylbutadien- monohydrobromide, Ph.D. Dissertation, Ohio State Univ., Columbus, OH, 1939. [all data]
Streiff, Zimmerman, et al., 1948
Streiff, A.J.; Zimmerman, J.C.; Soule, L.F.; Butt, M.T.; Sedlak, V.A.; Willingham, C.B.; Rossini, F.D.,
Purification, Purity, and Freezing Points of 30 Hydrocarbons of the API-Standard and API-NBS Series,
J. Res. Natl. Bur. Stand. (U. S.), 1948, 41, 323. [all data]
Reid, 1972
Reid, Robert C.,
Handbook on vapor pressure and heats of vaporization of hydrocarbons and related compounds, R. C. Wilhort and B. J. Zwolinski, Texas A Research Foundation. College Station, Texas(1971). 329 pages.$10.00,
AIChE J., 1972, 18, 6, 1278-1278, https://doi.org/10.1002/aic.690180637
. [all data]
Labbauf, Greenshields, et al., 1961
Labbauf, A.; Greenshields, J.B.; Rossini, F.D.,
Heats of formation, combustion, and vaporization of the 35 nonanes and 75 decanes,
J. Chem. Eng. Data, 1961, 6, 261-263. [all data]
Stephenson and Malanowski, 1987
Stephenson, Richard M.; Malanowski, Stanislaw,
Handbook of the Thermodynamics of Organic Compounds, 1987, https://doi.org/10.1007/978-94-009-3173-2
. [all data]