Hexane, 2,2,4-trimethyl-
- Formula: C9H20
- Molecular weight: 128.2551
- IUPAC Standard InChIKey: AFTPEBDOGXRMNQ-UHFFFAOYSA-N
- CAS Registry Number: 16747-26-5
- Chemical structure:
View 3d structure (requires JavaScript / HTML 5) - Other names: 2,2,4-Trimethylhexane

Condensed phase thermochemistry data

Data compiled by: Hussein Y. Afeefy, Joel F. Liebman, and Stephen E. Stein
Quantity | Value | Units | Method | Reference | Comment |
---|---|---|---|---|---|
ΔfH°liquid | -282.8 ± 1.0 | kJ/mol | Ccr | Good, 1969 | |
Quantity | Value | Units | Method | Reference | Comment |
ΔcH°liquid | -6117.05 ± 0.84 | kJ/mol | Ccr | Good, 1969 | Corresponding ΔfHºliquid = -282.8 kJ/mol (simple calculation by NIST; no Washburn corrections) |

Phase change data

Data compiled as indicated in comments:
BS - Robert L. Brown and Stephen E. Stein
TRC - Thermodynamics Research Center, NIST Boulder Laboratories, Chris Muzny director
AC - William E. Acree, Jr., James S. Chickos
Quantity | Value | Units | Method | Reference | Comment |
---|---|---|---|---|---|
Tboil | 399.6 ± 0.4 | K | AVG | N/A | Average of 6 values; Individual data points |
Quantity | Value | Units | Method | Reference | Comment |
Tfus | 153.15 | K | N/A | Streiff, Zimmerman, et al., 1948 | Uncertainty assigned by TRC = 0.4 K; TRC |
Tfus | 149.75 | K | N/A | Howard, Mears, et al., 1947 | Uncertainty assigned by TRC = 0.2 K; TRC |
Tfus | 149.77 | K | N/A | Brooks, 1943 | Uncertainty assigned by TRC = 1.5 K; TRC |
Tfus | 143.62 | K | N/A | Brooks, Cleaton, et al., 1937 | Uncertainty assigned by TRC = 0.6 K; identification somewhat uncertain; TRC |
Quantity | Value | Units | Method | Reference | Comment |
ΔvapH° | 40.7 | kJ/mol | N/A | Reid, 1972 | AC |
Enthalpy of vaporization
ΔvapH (kJ/mol) | Temperature (K) | Method | Reference | Comment |
---|---|---|---|---|
39.5 | 303. | A | Stephenson and Malanowski, 1987 | Based on data from 288. to 410. K.; AC |
41.0 | 278. | A | Stephenson and Malanowski, 1987 | Based on data from 238. to 393. K.; AC |
40.5 | 288. | IP | Osborn and Douslin, 1974 | Based on data from 238. to 303. K.; AC |
Antoine Equation Parameters
log10(P) = A − (B / (T + C))
P = vapor pressure (bar)
T = temperature (K)
View plot Requires a JavaScript / HTML 5 canvas capable browser.
Temperature (K) | A | B | C | Reference | Comment |
---|---|---|---|---|---|
238. to 303. | 4.31484 | 1528.134 | -42.976 | Osborn and Douslin, 1974 | Coefficents calculated by NIST from author's data. |

Henry's Law data

Data compiled by: Rolf Sander
Henry's Law constant (water solution)
kH(T) = k°H exp(d(ln(kH))/d(1/T) ((1/T) - 1/(298.15 K)))
k°H = Henry's law constant for solubility in water at 298.15 K (mol/(kg*bar))
d(ln(kH))/d(1/T) = Temperature dependence constant (K)
k°H (mol/(kg*bar)) | d(ln(kH))/d(1/T) (K) | Method | Reference | Comment |
---|---|---|---|---|
0.00021 | Q | N/A | missing citation give several references for the Henry's law constants but don't assign them to specific species. |

Normal alkane RI, non-polar column, isothermal

Data compiled by: NIST Mass Spectrometry Data Center, William E. Wallace, director

Column type CapillaryCapillaryCapillaryCapillary
Active phase Methyl SiliconeOV-101OV-101Squalane
Column length (m) 74.6  150.
Carrier gas N2  He
Substrate
Column diameter (mm) 0.28  0.35
Phase thickness (μm)
Temperature (C) 50.50.70.86.
I 789.791.793.791.
ReferenceN/AWu and Lu, 1984Wu and Lu, 1984Vigdergauz and Martynov, 1971
Comment MSDC-RI MSDC-RI MSDC-RI MSDC-RI

Kovats' RI, non-polar column, isothermal

View large format table.

Column type Active phase Temperature (C) I Reference Comment
CapillarySqualane100.777.Heinzen, Soares, et al., 1999
CapillarySqualane25.786.Hilal, Carreira, et al., 1994
CapillarySqualane50.789.2Lunskii and Paizanskaya, 1988He; Column length: 50. m; Column diameter: 0.22 mm
CapillarySqualane70.792.Lunskii and Paizanskaya, 1988He; Column length: 50. m; Column diameter: 0.22 mm
CapillaryDB-160.792.8Lubeck and Sutton, 1983Column length: 60. m; Column diameter: 0.264 mm
CapillaryDB-160.792.8Lubeck and Sutton, 198360. m/0.259 mm/1. μm
CapillaryOV-10150.791.Johansen and Ettre, 1982100. m/0.27 mm/0.20 μm
CapillaryOV-10150.791.Johansen and Ettre, 198255. m/0.27 mm/0.9 μm
CapillarySF-9650.791.Johansen and Ettre, 198291.4 m/0.31 mm/0.20 μm
CapillarySqualane86.794.2Nabivach and Kirilenko, 1979N2; Column length: 50. m
CapillarySqualane86.794.3Nabivach and Kirilenko, 1979N2; Column length: 50. m
CapillarySqualane60.790.Chretien and Dubois, 1976
CapillarySqualane60.790.7Chretien and Dubois, 1976
CapillaryVacuum Grease Oil (VM-4)95.788.8Sultanov and Arustamova, 1975N2; Column length: 150. m; Column diameter: 0.25 mm
PackedSE-30110.793.Mitra, Mohan, et al., 1974N2, Chrom W; Column length: 6.1 m
PackedSE-30120.800.Mitra, Mohan, et al., 1974N2, Chrom W; Column length: 6.1 m
PackedSE-30130.800.Mitra, Mohan, et al., 1974N2, Chrom W; Column length: 6.1 m
PackedSE-30140.800.Mitra, Mohan, et al., 1974N2, Chrom W; Column length: 6.1 m
CapillarySqualane100.792.Mitra, Mohan, et al., 1974, 2H2; Column length: 50. m; Column diameter: 0.2 mm
CapillarySqualane50.789.Rijks and Cramers, 1974N2; Column length: 100. m; Column diameter: 0.25 mm
CapillarySqualane70.792.Rijks and Cramers, 1974N2; Column length: 100. m; Column diameter: 0.25 mm
CapillaryVacuum Grease Oil (VM-4)35.783.Sidorov, Petrova, et al., 1972
CapillaryVacuum Grease Oil (VM-4)45.785.Sidorov, Petrova, et al., 1972
CapillaryVacuum Grease Oil (VM-4)50.786.Sidorov, Petrova, et al., 1972
CapillaryVacuum Grease Oil (VM-4)58.787.Sidorov, Petrova, et al., 1972
CapillaryVacuum Grease Oil (VM-4)68.789.Sidorov, Petrova, et al., 1972
PackedSE-3080.794.Mitra and Saha, 1970N2
CapillarySqualane60.791.Matukuma, 1969N2; Column length: 91.4 m; Column diameter: 0.25 mm
PackedSqualane30.786.5Tourres, 1967H2; Column length: 10. m
PackedSqualane50.789.Tourres, 1967H2; Column length: 10. m
CapillarySqualane30.787.Tourres, 1967, 2H2; Column length: 100. m; Column diameter: 0.25 mm
CapillarySqualane50.790.Tourres, 1967, 2H2; Column length: 100. m; Column diameter: 0.25 mm
CapillarySqualane70.792.Tourres, 1967, 2H2; Column length: 100. m; Column diameter: 0.25 mm

Kovats' RI, non-polar column, temperature ramp

View large format table.

Column type Active phase I Reference Comment
CapillaryDB-5777.Ramarathnam, Rubin, et al., 1993He, 30. C @ 2. min, 10. K/min, 280. C @ 3. min; Column length: 30. m; Column diameter: 0.13 mm
CapillaryOV-101789.Hayes and Pitzer, 1982110. m/0.25 mm/0.20 μm, He, 1. K/min; Tstart: 35. C; Tend: 200. C
CapillaryApiezon L786.Louis, 1971N2, 1. K/min; Column length: 50. m; Column diameter: 0.25 mm; Tstart: 60. C

Kovats' RI, non-polar column, custom temperature program

View large format table.

Column type Active phase I Reference Comment
CapillaryPetrocol DH-100790.8Haagen-Smit Laboratory, 1997He; Column length: 100. m; Column diameter: 0.2 mm; Program: 5C(10min) => 5C/min => 50C(48min) => 1.5C/min => 195C(91min)
CapillarySqualane790.Korol and Lysyuk, 1980Program: not specified

Van Den Dool and Kratz RI, non-polar column, temperature ramp

View large format table.

Column type Active phase I Reference Comment
CapillaryPetrocol DH792.8Censullo, Jones, et al., 200350. m/0.25 mm/0.5 μm, He, 35. C @ 10. min, 3. K/min, 200. C @ 10. min
CapillaryOV-101791.6Yin, Liu, et al., 2001N2, 1. K/min; Column length: 80. m; Column diameter: 0.22 mm; Tstart: 30. C; Tend: 130. C
CapillaryPetrocol DH789.61Subramaniam, Bochniak, et al., 1994100. m/0.25 mm/0.5 μm, He, 1. K/min; Tstart: 30. C; Tend: 220. C
CapillaryPetrocol DH790.White, Hackett, et al., 1992100. m/0.25 mm/0.5 μm, He, 1. K/min; Tstart: 30. C; Tend: 220. C
CapillaryOV-101789.Hayes and Pitzer, 1981108. m/0.25 mm/0.2 μm, 1. K/min; Tstart: 35. C; Tend: 200. C

Van Den Dool and Kratz RI, non-polar column, custom temperature program

View large format table.

Column type Active phase I Reference Comment
CapillaryOV-101792.Wu and Lu, 1984Program: not specified

Normal alkane RI, non-polar column, temperature ramp

View large format table.

Column type Active phase I Reference Comment
CapillaryPolydimethyl siloxane: CP-Sil 5 CB795.Bramston-Cook, 201360. m/0.25 mm/1.0 μm, Helium, 45. C @ 1.45 min, 3.6 K/min, 210. C @ 2.72 min
CapillaryPetrocol DH791.Supelco, 2012100. m/0.25 mm/0.50 μm, Helium, 20. C @ 15. min, 15. K/min, 220. C @ 30. min

Normal alkane RI, non-polar column, custom temperature program

View large format table.

Column type Active phase I Reference Comment
CapillaryMethyl Silicone789.Feng and Mu, 2007Program: not specified
CapillaryOV-101791.Du and Liang, 2003Program: not specified
CapillaryPolydimethyl siloxane777.Junkes, Castanho, et al., 2003Program: not specified
CapillaryPolydimethyl siloxanes792.Yin, Guo, et al., 2001Program: not specified
CapillaryMethyl Silicone790.Spieksma, 1999Program: not specified
CapillaryOV-1, SE-30, Methyl silicone, SP-2100, OV-101, DB-1, etc.789.Waggott and Davies, 1984Hydrogen; Column length: 50. m; Column diameter: 0.32 mm; Program: not specified

References

Good, 1969
Good, W.D.,
Enthalpies of combustion and formation of 11 isomeric nonanes,
J. Chem. Eng. Data, 1969, 14, 231-235. [all data]
Streiff, Zimmerman, et al., 1948
Streiff, A.J.; Zimmerman, J.C.; Soule, L.F.; Butt, M.T.; Sedlak, V.A.; Willingham, C.B.; Rossini, F.D.,
Purification, Purity, and Freezing Points of 30 Hydrocarbons of the API-Standard and API-NBS Series,
J. Res. Natl. Bur. Stand. (U. S.), 1948, 41, 323. [all data]
Howard, Mears, et al., 1947
Howard, F.L.; Mears, T.W.; Fookson, A.; Pomerantz, P.; Brooks, D.B.,
Preparation and physical properties of several aliphatic hydrocarbons and intermediates,
J. Res. Natl. Bur. Stand. (U. S.), 1947, 38, 365. [all data]
Brooks, 1943
Brooks, D.B.,
, Natl. Advis. Comm. Aeronaut., Rep. Natl. Bur. Stand., Was hington, D. C., 1943. [all data]
Brooks, Cleaton, et al., 1937
Brooks, D.B.; Cleaton, R.B.; Carter, F.R.,
Paraffin Hydrocarbons Isolated from Crude Synthetic Isooctane (2,2,4-Trimethylpentane),
J. Res. Natl. Bur. Stand. (U. S.), 1937, 19, 319. [all data]
Reid, 1972
Reid, Robert C.,
Handbook on vapor pressure and heats of vaporization of hydrocarbons and related compounds, R. C. Wilhort and B. J. Zwolinski, Texas A Research Foundation. College Station, Texas(1971). 329 pages.$10.00,
AIChE J., 1972, 18, 6, 1278-1278, https://doi.org/10.1002/aic.690180637
. [all data]
Stephenson and Malanowski, 1987
Stephenson, Richard M.; Malanowski, Stanislaw,
Handbook of the Thermodynamics of Organic Compounds, 1987, https://doi.org/10.1007/978-94-009-3173-2
. [all data]
Osborn and Douslin, 1974
Osborn, Ann G.; Douslin, Donald R.,
Vapor-pressure relations for 15 hydrocarbons,
J. Chem. Eng. Data, 1974, 19, 2, 114-117, https://doi.org/10.1021/je60061a022
. [all data]