2,3-Dimethyl-1-hexene
- Formula: C8H16
- Molecular weight: 112.2126
- IUPAC Standard InChIKey: LVLXQRZPKUFJJQ-UHFFFAOYSA-N
- CAS Registry Number: 16746-86-4
- Chemical structure:
View 3d structure (requires JavaScript / HTML 5) - Other names: 1-Hexene, 2,3-dimethyl-; 2,3-Dimethylhex-1-ene

Phase change data

Data compiled as indicated in comments:
TRC - Thermodynamics Research Center, NIST Boulder Laboratories, Chris Muzny director
AC - William E. Acree, Jr., James S. Chickos
Quantity | Value | Units | Method | Reference | Comment |
---|---|---|---|---|---|
Tboil | 383.69 | K | N/A | Boord, Henne, et al., 1949 | Uncertainty assigned by TRC = 0.6 K; TRC |
Tboil | 383.69 | K | N/A | Boord, Greenlee, et al., 1946 | Uncertainty assigned by TRC = 0.4 K; TRC |
Tboil | 383.69 | K | N/A | Anonymous, 1942 | Uncertainty assigned by TRC = 0.2 K; TRC |
Quantity | Value | Units | Method | Reference | Comment |
ΔvapH° | 38.5 | kJ/mol | N/A | Reid, 1972 | AC |

Kovats' RI, non-polar column, isothermal

View large format table.

Column type Active phase Temperature (C) I Reference Comment
CapillaryPetrocol DH30.746.7Soják, Addová, et al., 2004150. m/0.25 mm/1. μm, H2
CapillarySqualane30.737.5Soják, Addová, et al., 2004He; Column length: 93. m; Column diameter: 0.25 mm
CapillaryOV-10140.748.Laub and Purnell, 1988
CapillaryOV-10160.749.Laub and Purnell, 1988
CapillaryOV-10180.751.Laub and Purnell, 1988
CapillaryOV-10150.748.8Boneva and Dimov, 1986100. m/0.27 mm/0.9 μm, N2
CapillaryOV-10170.750.Boneva and Dimov, 1986100. m/0.27 mm/0.9 μm, N2
CapillarySqualane50.739.1Boneva and Dimov, 1986N2; Column length: 100. m; Column diameter: 0.25 mm
CapillarySqualane70.740.6Boneva and Dimov, 1986N2; Column length: 100. m; Column diameter: 0.25 mm
CapillaryDB-140.747.Lubeck and Sutton, 198460. m/0.264 mm/0.25 μm, H2
CapillaryHP-PONA40.747.Lubeck and Sutton, 198450. m/0.21 mm/0.5 μm, H2
CapillarySqualane50.739.Chretien and Dubois, 1976
CapillarySqualane100.741.Lulova, Leont'eva, et al., 1976He; Column length: 120. m; Column diameter: 0.25 mm
CapillarySqualane50.739.Rijks and Cramers, 1974N2; Column length: 100. m; Column diameter: 0.25 mm
CapillarySqualane70.741.Rijks and Cramers, 1974N2; Column length: 100. m; Column diameter: 0.25 mm
CapillarySqualane40.741.Matukuma, 1969N2; Column length: 91.4 m; Column diameter: 0.25 mm

Normal alkane RI, non-polar column, isothermal

View large format table.

Column type Active phase Temperature (C) I Reference Comment
CapillaryMethyl Silicone50.739.N/AN2; Column length: 74.6 m; Column diameter: 0.28 mm

Normal alkane RI, non-polar column, temperature ramp

View large format table.

Column type Active phase I Reference Comment
CapillaryPetrocol DH748.Supelco, 2012100. m/0.25 mm/0.50 μm, Helium, 20. C @ 15. min, 15. K/min, 220. C @ 30. min
CapillaryPetrocol DH747.Sojak, Kubinec, et al., 2006150. m/0.25 mm/1.0 μm, 1. K/min; Tstart: 40. C; Tend: 300. C
CapillaryPetrocol DH747.Sojak, Kubinec, et al., 2006150. m/0.25 mm/1.0 μm, 1. K/min; Tstart: 40. C; Tend: 300. C
CapillaryOV-101751.Orav, Kailas, et al., 199950. m/0.20 mm/0.50 μm, Helium, 30. C @ 6. min, 1. K/min; Tend: 100. C

Normal alkane RI, non-polar column, custom temperature program

View large format table.

Column type Active phase I Reference Comment
CapillaryPolydimethyl siloxane741.Junkes, Castanho, et al., 2003Program: not specified

References

Boord, Henne, et al., 1949
Boord, C.E.; Henne, A.L.; Greenlee, K.W.; Perilstein, W.L.; Derfer, J.M.,
The Grignard Reagent in hydrocarbon synthesis,
Ind. Eng. Chem., 1949, 41, 609. [all data]
Boord, Greenlee, et al., 1946
Boord, C.E.; Greenlee, K.W.; Perilstein, W.L.,
The Synthesis, Purification and Prop. of Hydrocarbons of Low Mol. Weight, Am. Pet. Inst. Res. Proj. 45, Eighth Annu. Rep., Ohio State Univ., June 30, 1946. [all data]
Anonymous, 1942
Anonymous, R.,
, Am. Pet. Inst. Res. Proj. 6, Natl. Bur. Stand., 1942. [all data]
Reid, 1972
Reid, Robert C.,
Handbook on vapor pressure and heats of vaporization of hydrocarbons and related compounds, R. C. Wilhort and B. J. Zwolinski, Texas A Research Foundation. College Station, Texas(1971). 329 pages.$10.00,
AIChE J., 1972, 18, 6, 1278-1278, https://doi.org/10.1002/aic.690180637
. [all data]