1-Octanone, 1-phenyl-
- Formula: C14H20O
- Molecular weight: 204.3080
- IUPAC Standard InChIKey: UDEVCZRUNOLVLU-UHFFFAOYSA-N
- CAS Registry Number: 1674-37-9
- Chemical structure:
View 3d structure (requires JavaScript / HTML 5) - Other names: Octanophenone; n-Octanophenone; Caprylophenone; Heptyl phenyl ketone; Ketone, heptyl phenyl; 1-phenyloctan-1-one

Phase change data

Data compiled by: Robert L. Brown and Stephen E. Stein
Quantity | Value | Units | Method | Reference | Comment |
---|---|---|---|---|---|
Tboil | 560.7 | K | N/A | Aldrich Chemical Company Inc., 1990 |
Reduced pressure boiling point
Tboil (K) | Pressure (atm) | Reference |
---|---|---|
437.2 | 0.020 | Weast and Grasselli, 1989 |
439. to 441. | 0.026 | Frinton Laboratories Inc., 1986 |

References

Aldrich Chemical Company Inc., 1990
Aldrich Chemical Company Inc.,
Catalog Handbook of Fine Chemicals, Aldrich Chemical Company, Inc., Milwaukee WI, 1990, 1. [all data]
Weast and Grasselli, 1989
CRC Handbook of Data on Organic Compounds, 2nd Editon, Weast,R.C and Grasselli, J.G., ed(s)., CRC Press, Inc., Boca Raton, FL, 1989, 1. [all data]
Frinton Laboratories Inc., 1986
Frinton Laboratories Inc.,
Catalog Number 11, Frinton Laboratories Inc., Vineland, NJ, 1986, 99. [all data]
Lang (editor), 1971
Lang (editor), L.,
Absorption Spectra in the Ultraviolet and Visible Region, 1971, 15, 9. [all data]