Cyclohexene, 1,2-dimethyl-
- Formula: C8H14
- Molecular weight: 110.1968
- IUPAC Standard InChIKey: TXNWMICHNKMOBR-UHFFFAOYSA-N
- CAS Registry Number: 1674-10-8
- Chemical structure:
View 3d structure (requires JavaScript / HTML 5) - Other names: 1,2-Dimethyl-1-cyclohexene; 1,2-Dimethylcyclohexene

Phase change data

Data compiled by: Thermodynamics Research Center, NIST Boulder Laboratories, Chris Muzny director
Quantity | Value | Units | Method | Reference | Comment |
---|---|---|---|---|---|
Tboil | 388. | K | N/A | Goering and McCarron, 1956 | Uncertainty assigned by TRC = 5. K; isomer not definitely identified |
Tboil | 408.9 | K | N/A | Signaigo and Cramer, 1933 | Uncertainty assigned by TRC = 2. K |
Tboil | 439. | K | N/A | Sabatier and Mailhe, 1905 | Uncertainty assigned by TRC = 2. K |
Quantity | Value | Units | Method | Reference | Comment |
Tfus | 189.000 | K | N/A | Streiff, Schultz, et al., 1960 | Uncertainty assigned by TRC = 0.01 K |

Normal alkane RI, non-polar column, custom temperature program

Column type | Active phase | I | Reference | Comment |
---|---|---|---|---|
Capillary | Methyl Silicone | 868. | Zenkevich, 2000 | Program: not specified |

References

Goering and McCarron, 1956
Goering, H.L.; McCarron, F.H.,
J. Am. Chem. Soc., 1956, 78, 2270-4. [all data]
Signaigo and Cramer, 1933
Signaigo, F.K.; Cramer, P.L.,
The preparation of some mono- and dialkylcylohexanes,
J. Am. Chem. Soc., 1933, 55, 3326-32. [all data]
Sabatier and Mailhe, 1905
Sabatier, P.; Mailhe, A.,
Synthesis of Three Tertiary Dimethylcyclohexanols and the Corresponding Hydrocarbons,
C. R. Hebd. Seances Acad. Sci., 1905, 141, 20. [all data]
Streiff, Schultz, et al., 1960
Streiff, A.J.; Schultz, L.H.; Krouskop, N.C.; Moore, J.W.; Rossini, F.D.,
Purification, Purity, and Freezing Points of 16 API Standard and API Research Hydrocarbons,
J. Chem. Eng. Data, 1960, 5, 193-5. [all data]
Wheeler and Mateos, 1960
Wheeler, O.H.; Mateos, J.L.,
Certain condensations at the terminal methyl group of 3-phenylpentane-2,4-dione through its dipotassio derivative cyclizations,
J. Org. Chem., 1960, 25, 1110-1114. [all data]
Zenkevich, 2000
Zenkevich, I.G.,
Mutual Correlation between Gas Chromatographic Retention Indices of Unsaturated and Saturated Hydrocarbons found by Molecular Dynamics,
Z. Anal. Chem., 2000, 55, 10, 1091-1097. [all data]