Cholest-3-ene
- Formula: C27H46
- Molecular weight: 370.6541
- IUPAC Standard InChIKey: SFBMPHLOQAKIBY-UHFFFAOYSA-N
- CAS Registry Number: 16732-84-6
- Chemical structure:
View 3d structure (requires JavaScript / HTML 5) - Stereoisomers:

Phase change data

Data compiled by: Thermodynamics Research Center, NIST Boulder Laboratories, Chris Muzny director
Quantity | Value | Units | Method | Reference | Comment |
---|---|---|---|---|---|
Tfus | 347.2 | K | N/A | Turner, Meador, et al., 1957 | Uncertainty assigned by TRC = 2. K |

Reaction thermochemistry data

Data compiled by: Hussein Y. Afeefy, Joel F. Liebman, and Stephen E. Stein
Individual Reactions
By formula: H2 + C27H46 = C27H48
Quantity | Value | Units | Method | Reference | Comment |
---|---|---|---|---|---|
ΔrH° | -117.0 ± 0.59 | kJ/mol | Chyd | Turner, Meador, et al., 1957, 2 | liquid phase; solvent: Acetic acid |

References

Turner, Meador, et al., 1957
Turner, R.B.; Meador, W.R.; Winkler, R.E.,
Heats of Hydrogenation II. Heats of Hydrogenation and the Acid-catalyzed Isomerization of Some Unsaturated Steroids,
J. Am. Chem. Soc.Q 79, 1957, 4122-27. [all data]
Turner, Meador, et al., 1957, 2
Turner, R.B.; Meador, W.R.; Winkler, R.E.,
Heats of hydrogenation. II. Heats of hydrogenation and the acid-catalyzed isomerization of some unsaturated steroids,
J. Am. Chem. Soc., 1957, 79, 4122-4127. [all data]