Vanadium anion
- Formula: V-
- Molecular weight: 50.9420
- CAS Registry Number: 16727-17-6

Gas phase ion energetics data

Data compiled by: John E. Bartmess
Protonation reactions
V- + = HV
Quantity | Value | Units | Method | Reference | Comment |
---|---|---|---|---|---|
ΔrH° | 1421. ± 14. | kJ/mol | G+TS | Sallans, Lane, et al., 1985 | gas phase |
ΔrH° | 1426. ± 15. | kJ/mol | Acid | Feigerle, Corderman, et al., 1981 | gas phase |
Quantity | Value | Units | Method | Reference | Comment |
ΔrG° | 1389. ± 13. | kJ/mol | IMRB | Sallans, Lane, et al., 1985 | gas phase |
ΔrG° | 1394. ± 22. | kJ/mol | H-TS | Feigerle, Corderman, et al., 1981 | gas phase |

Ion clustering data

Data compiled by: John E. Bartmess
Clustering reactions
By formula: V- + C6H5F = (V- • C6H5F)
Quantity | Value | Units | Method | Reference | Comment |
---|---|---|---|---|---|
ΔrH° | 60. ± 16. | kJ/mol | N/A | Judai, Hirano, et al., 1997 | gas phase |
By formula: (V- • C6H5F) + C6H6 = (V- • C6H6 • C6H5F)
Quantity | Value | Units | Method | Reference | Comment |
---|---|---|---|---|---|
ΔrH° | 10. ± 63. | kJ/mol | N/A | Judai, Hirano, et al., 1997 | gas phase |

Reaction thermochemistry data

Data compiled by: John E. Bartmess

Individual Reactions

V- + Hydrogen cation = HV

By formula: V- + H+ = HV

Quantity Value Units Method Reference Comment
Δr1421. ± 14.kJ/molG+TSSallans, Lane, et al., 1985gas phase
Δr1426. ± 15.kJ/molAcidFeigerle, Corderman, et al., 1981gas phase
Quantity Value Units Method Reference Comment
Δr1389. ± 13.kJ/molIMRBSallans, Lane, et al., 1985gas phase
Δr1394. ± 22.kJ/molH-TSFeigerle, Corderman, et al., 1981gas phase

(V- • Benzene, fluoro-) + Benzene = (V- • Benzene • Benzene, fluoro-)

By formula: (V- • C6H5F) + C6H6 = (V- • C6H6 • C6H5F)

Quantity Value Units Method Reference Comment
Δr10. ± 63.kJ/molN/AJudai, Hirano, et al., 1997gas phase

V- + Benzene, fluoro- = (V- • Benzene, fluoro-)

By formula: V- + C6H5F = (V- • C6H5F)

Quantity Value Units Method Reference Comment
Δr60. ± 16.kJ/molN/AJudai, Hirano, et al., 1997gas phase

Gas phase thermochemistry data

Data compiled as indicated in comments:
B - John E. Bartmess

Quantity Value Units Method Reference Comment
Δfgas110.77 ± 0.57kcal/molR-EAFeigerle, Corderman, et al., 1981B
Quantity Value Units Method Reference Comment
gas,1 bar43.843cal/mol*KReviewChase, 1998Data last reviewed in March, 1984

References

Sallans, Lane, et al., 1985
Sallans, L.; Lane, K.R.; Squires, R.R.; Freiser, B.S.,
Generation and reactions of atomic metal anions in the gas phase. Determination of the heterolytic and homolytic bond energies of VH, VrH, FeH, CoH, and MoH,
J. Am. Chem. Soc., 1985, 107, 4379. [all data]
Feigerle, Corderman, et al., 1981
Feigerle, C.S.; Corderman, R.R.; Bobashev, S.V.; Lineberger, W.C.,
Binding Energies and Structure of Transition Metal Negative Ions,
J. Chem. Phys., 1981, 74, 3, 1580, https://doi.org/10.1063/1.441289
. [all data]
Judai, Hirano, et al., 1997
Judai, K.; Hirano, M.; Kawamata, H.; Yabushita, S.; Nakajima, A.; Kaya, K.,
Formation of Vanadium-Arene Complex Anions and Their Photoelectron Spectroscopy,
Chem. Phys. Lett., 1997, 270, 1-2, 23, https://doi.org/10.1016/S0009-2614(97)00336-9
. [all data]