2-Cyclohexen-1-ol, 3-methyl-6-(1-methylethyl)-, trans-
- Formula: C10H18O
- Molecular weight: 154.2493
- IUPAC Standard InChIKey: HPOHAUWWDDPHRS-VHSXEESVSA-N
- CAS Registry Number: 16721-39-4
- Chemical structure:
View 3d structure (requires JavaScript / HTML 5) - Stereoisomers:
- Other names: (1R,6R)-6-Isopropyl-3-methylcyclohex-2-enol, rel-; p-Menth-1-en-3-ol, trans-; trans-p-Menth-1-en-3-ol; trans-Piperitol; 6-Isopropyl-3-methyl-2-cyclohexen-1-ol, (E)-; E-Piperitol; trans-3-methyl-6-(1-methylethyl)-2-cyclohexen-1-ol; 2-Cyclohexen-1-ol, 3-methyl-6-(1-methylethyl)-, (1R,6R)-rel-; Piperitol, trans-; trans-Pipertiol (=trans-p-Menth-1-en-3-ol); (E)-Piperitol acetate; Piperitol isomer; trans-Piperitol (trans-p-menth-1-en-3-ol); trans-piperitol (= trans- pmenth-1-en-3-ol); trans-6-(isopropyl)-3-methylcyclohex-2-en-1-ol

Kovats' RI, non-polar column, temperature ramp

Column type | Active phase | I | Reference | Comment |
---|---|---|---|---|
Capillary | DB-5 | 1205. | Adams, González Elizondo, et al., 2006 | 30. m/0.26 mm/0.25 μm, He, 3. K/min; Tstart: 60. C; Tend: 246. C |
Capillary | DB-5 | 1201. | Sylvestre, Pichette, et al., 2006 | 30. m/0.25 mm/0.25 μm, 40. C @ 2. min, 2. K/min, 210. C @ 33. min |
Capillary | DB-5 | 1205. | Adams and Nguyen, 2005 | 30. m/0.26 mm/0.25 μm, He, 3. K/min; Tstart: 60. C; Tend: 246. C |
Capillary | HP-5MS | 1208. | Asuming, Beauchamp, et al., 2005 | 30. m/0.25 mm/0.25 μm, He, 50. C @ 10. min, 3. K/min, 250. C @ 5. min |
Capillary | BP-5 | 1197. | Baranauskiene, Venskutonis, et al., 2005 | 50. m/0.32 mm/0.25 μm, He, 50. C @ 2. min, 5. K/min, 260. C @ 5. min |
Capillary | DB-5 | 1212. | Avato, Raffo, et al., 2004 | 30. m/0.25 mm/0.25 μm, H2, 4. K/min, 280. C @ 30. min; Tstart: 40. C |
Capillary | HP-5 | 1208. | Lopes, Strobl, et al., 2004 | 30. m/0.25 mm/0.25 μm, He, 3. K/min; Tstart: 60. C; Tend: 260. C |
Capillary | CP Sil 5 CB | 1194. | Ogunwande, Olawore, et al., 2003 | 25. m/0.25 mm/0.15 μm, He, 3. K/min; Tstart: 50. C; Tend: 230. C |
Capillary | SE-30 | 1194. | Palá-Paúl, Velasco-Negueruela, et al., 2002 | 25. m/0.22 mm/0.25 μm, He, 4. K/min; Tstart: 70. C; Tend: 220. C |
Capillary | SE-54 | 1205. | Adams, 2000 | 30. m/0.26 mm/0.25 μm, He, 3. K/min; Tstart: 60. C; Tend: 246. C |
Capillary | SE-54 | 1205. | Adams, 2000, 2 | 30. m/0.26 mm/0.25 μm, 3. K/min; Tstart: 60. C; Tend: 246. C |
Capillary | DB-5 | 1205. | Adams, 2000, 3 | 30. m/0.26 mm/0.25 μm, He, 3. K/min; Tstart: 60. C; Tend: 246. C |
Capillary | DB-5 | 1205. | Adams, 1999 | 30. m/0.26 mm/0.25 μm, He, 3. K/min; Tstart: 60. C; Tend: 246. C |
Capillary | BP-1 | 1181. | Vera and Chane-Ming, 1999 | 50. m/0.25 mm/0.25 μm, 2. K/min; Tstart: 60. C; Tend: 260. C |
Capillary | BP-1 | 1186. | Vera and Chane-Ming, 1999 | 50. m/0.25 mm/0.25 μm, 2. K/min; Tstart: 60. C; Tend: 260. C |

Kovats' RI, non-polar column, custom temperature program

Column type | Active phase | I | Reference | Comment |
---|---|---|---|---|
Capillary | DB-5MS | 1203. | Tuberoso, Kowalczyk, et al., 2005 | 30. m/0.25 mm/0.25 μm, He; Program: 60C(5min) => 2C/min => 140C= 5C/min => 250C(5min) |
Capillary | BP-1 | 1180. | Dwivedi, Khan, et al., 2004 | 25. m/0.25 mm/0.25 μm, N2; Program: 60C => 5C/min => 220C(5min) => 3C/min => 245C(5min) |
Capillary | HP-5 | 1205. | Sibanda, Chigwada, et al., 2004 | 30. m/0.25 mm/0.25 μm, He; Program: 40C(10min) => 3C/min => 200C => 2C/min => 220C |
Capillary | DB-5 | 1206. | Santos, Andrade, et al., 1998 | 30. m/0.25 mm/0.25 μm, He; Program: 40C => 2C/min => 60C => 4C/min => 240C |

Kovats' RI, polar column, temperature ramp

Column type | Active phase | I | Reference | Comment |
---|---|---|---|---|
Capillary | Supelcowax-10 | 1713. | Sylvestre, Pichette, et al., 2006 | 30. m/0.25 mm/0.25 μm, 40. C @ 2. min, 2. K/min, 210. C @ 33. min |
Capillary | DB-Wax | 1742. | Lopes, Strobl, et al., 2004 | 30. m/0.32 mm/0.25 μm, He, 40. C @ 5. min, 3. K/min; Tend: 220. C |
Capillary | Carbowax 20M | 1675. | Vera and Chane-Ming, 1999 | 50. m/0.32 mm/0.2 μm, 2. K/min; Tstart: 60. C; Tend: 260. C |
Capillary | Carbowax 20M | 1679. | Vera and Chane-Ming, 1999 | 50. m/0.32 mm/0.2 μm, 2. K/min; Tstart: 60. C; Tend: 260. C |

Van Den Dool and Kratz RI, non-polar column, temperature ramp

Column type | Active phase | I | Reference | Comment |
---|---|---|---|---|
Capillary | HP-5MS | 1208. | Benkaci-Ali, Baaliouamer, et al., 2007 | 30. m/0.25 mm/0.25 μm, He, 60. C @ 8. min, 2. K/min, 250. C @ 30. min |
Capillary | BP-1 | 1189. | Lesueur, de Rocca Serra, et al., 2007 | 50. m/0.22 mm/0.25 μm, He, 2. K/min, 220. C @ 20. min; Tstart: 60. C |
Capillary | HP-5 | 1208. | Quijano, Salamanca, et al., 2007 | 30. m/0.25 mm/0.25 μm, He, 50. C @ 4. min, 4. K/min, 250. C @ 10. min |
Capillary | CP Sil 5 CB | 1196. | Andrianoelisoa H.S., Menut C., et al., 2006 | 30. m/0.25 mm/0.25 μm, N2, 5. K/min; Tstart: 50. C; Tend: 200. C |
Capillary | BP-1 | 1191. | Gonny, Cavaleiro, et al., 2006 | 50. m/0.22 mm/0.25 μm, He, 2. K/min, 220. C @ 20. min; Tstart: 60. C |
Capillary | HP-5MS | 1186. | Pavlovic, Kovacevic, et al., 2006 | 30. m/0.25 mm/0.25 μm, He, 3. K/min; Tstart: 60. C; Tend: 280. C |
Capillary | RTX-1 | 1189. | Paolini, Costa, et al., 2005 | 60. m/0.22 mm/0.25 μm, He, 2. K/min, 230. C @ 35. min; Tstart: 60. C |
Capillary | RTX-5 | 1208. | Dugo, Mondello, et al., 2004 | 30. m/0.25 mm/0.25 μm, He, 45. C @ 6. min, 3. K/min, 300. C @ 10. min |
Capillary | DB-5 | 1208. | Flamini, Cioni, et al., 2004 | 30. m/0.25 mm/0.25 μm, N2, 3. K/min; Tstart: 60. C; Tend: 240. C |
Capillary | HP-5 | 1205. | Javidnia, Miri, et al., 2004 | 30. m/0.25 mm/0.25 μm, He, 3. K/min; Tstart: 60. C; Tend: 260. C |
Capillary | DB-5MS | 1211. | Mardarowicz, Wianowska, et al., 2004 | 30. m/0.25 mm/0.25 μm, He, 40. C @ 2. min, 4. K/min; Tend: 280. C |
Capillary | HP-5MS | 1209. | Salido, Valenzuela, et al., 2004 | 30. m/0.25 mm/0.25 μm, He, 3. K/min; Tstart: 50. C; Tend: 250. C |
Capillary | HP-5 | 1208. | Sartoratto, Machado, et al., 2004 | 25. m/0.2 mm/0.33 μm, He, 3. K/min, 240. C @ 7. min; Tstart: 60. C |
Capillary | HP-5 | 1209. | Stashenko, Jaramillo, et al., 2004 | 50. m/0.2 mm/0.2 μm, He, 40. C @ 15. min, 3. K/min, 250. C @ 40. min |
Capillary | DB-5 | 1208. | Bader, Flamini, et al., 2003 | 30. m/0.25 mm/0.25 μm, He, 3. K/min; Tstart: 60. C; Tend: 240. C |
Capillary | RTX-5 | 1201. | Shellie, Marriott, et al., 2003 | 30. m/0.25 mm/0.25 μm, He, 45. C @ 6. min, 3. K/min; Tend: 250. C |
Capillary | HP-5 | 1208. | Tsiri, Kretsi, et al., 2003 | 30. m/0.25 mm/0.25 μm, He, 3. K/min; Tstart: 60. C; Tend: 280. C |
Capillary | HP-5 | 1207. | Flamini, Cioni, et al., 2002 | 30. m/0.25 mm/0.25 μm, N2, 60. C @ 10. min, 5. K/min; Tend: 220. C |
Capillary | CP Sil 5 CB | 1180. | Pino, Marbot, et al., 2002 | 30. m/0.25 mm/0.25 μm, H2, 60. C @ 10. min, 2. K/min, 280. C @ 40. min |
Capillary | HP-5 | 1205. | Aligiannis, Kalpoutzakis, et al., 2001 | 30. m/0.25 mm/0.25 μm, He, 60. C @ 5. min, 3. K/min; Tend: 280. C |
Capillary | BP-1 | 1187. | Rezzi, Cavaleiro, et al., 2001 | 50. m/0.22 mm/0.25 μm, 2. K/min, 220. C @ 20. min; Tstart: 60. C |
Capillary | HP-5MS | 1209. | Salido, Altarejos, et al., 2001 | 30. m/0.25 mm/0.25 μm, He, 3. K/min; Tstart: 50. C; Tend: 250. C |
Capillary | HP-5 | 1193. | Alonzo, Bosco, et al., 2000 | 30. m/0.20 mm/0.25 μm, He, 60. C @ 8. min, 4. K/min, 180. C @ 2. min |
Capillary | OV-1 | 1187. | Bicchi, Rubiolo, et al., 1998 | 25. m/0.25 mm/0.3 μm, 50. C @ 1. min, 3. K/min, 200. C @ 20. min |
Capillary | BP-1 | 1183. | Mariotti, Costa, et al., 1997 | 50. m/0.22 mm/0.25 μm, He, 2. K/min, 230. C @ 35. min; Tstart: 60. C |
Capillary | Methyl Silicone | 1203. | Píry, Príbela, et al., 1995 | 25. m/0.2 mm/0.3 μm, He, 2. K/min; Tstart: 40. C; Tend: 200. C |
Capillary | HP-101 | 1216. | Chung, Eiserich, et al., 1993 | N2, 3. K/min; Column length: 50. m; Column diameter: 0.25 mm; Tstart: 70. C; Tend: 200. C |
Capillary | DB-5 | 1202. | Le Quere and Latrasse, 1990 | 60. m/0.32 mm/1. μm, He, 3. K/min; Tstart: 40. C; Tend: 220. C |

Van Den Dool and Kratz RI, polar column, temperature ramp

Column type | Active phase | I | Reference | Comment |
---|---|---|---|---|
Capillary | BP-20 | 1753. | Lesueur, de Rocca Serra, et al., 2007 | 50. m/0.22 mm/0.25 μm, He, 2. K/min, 220. C @ 20. min; Tstart: 60. C |
Capillary | BP-20 | 1741. | Gonny, Cavaleiro, et al., 2006 | 50. m/0.22 mm/0.25 μm, He, 2. K/min, 220. C @ 20. min; Tstart: 60. C |
Capillary | RTX-Wax | 1738. | Paolini, Costa, et al., 2005 | 60. m/0.22 mm/0.25 μm, He, 2. K/min, 230. C @ 35. min; Tstart: 60. C |
Capillary | RTX-Wax | 1725. | Dugo, Mondello, et al., 2004 | 30. m/0.25 mm/0.25 μm, He, 45. C @ 6. min, 3. K/min, 240. C @ 10. min |
Capillary | RTX-Wax | 1725. | Shellie, Marriott, et al., 2003 | 30. m/0.25 mm/0.25 μm, He, 45. C @ 6. min, 3. K/min; Tend: 250. C |
Capillary | DB-Wax | 1745. | Brophy, Goldsack, et al., 2000 | 60. m/0.53 mm/1.0 μm, He, 3. K/min; Tstart: 50. C; Tend: 220. C |
Capillary | DB-Wax | 1691. | Choi and Sawamura, 2000 | 60. m/0.25 mm/0.25 μm, N2, 70. C @ 2. min, 2. K/min, 230. C @ 20. min |
Capillary | BP-20 | 1730. | Mariotti, Costa, et al., 1997 | 50. m/0.22 mm/0.25 μm, He, 2. K/min, 230. C @ 35. min; Tstart: 60. C |
Capillary | HP-FFAP | 1719. | Chung, Eiserich, et al., 1993 | He, 3. K/min; Column length: 50. m; Column diameter: 0.25 mm; Tstart: 60. C; Tend: 210. C |
Capillary | DB-Wax | 1679. | Le Quere and Latrasse, 1990 | 30. m/0.32 mm/0.5 μm, He, 3. K/min; Tstart: 40. C; Tend: 220. C |

Normal alkane RI, non-polar column, temperature ramp

Column type | Active phase | I | Reference | Comment |
---|---|---|---|---|
Capillary | HP-5 MS | 1208. | Jian-Yu, Zhu, et al., 2012 | 30. m/0.25 mm/0.25 μm, Helium, 40. C @ 1. min, 3. K/min, 250. C @ 3. min |
Capillary | HP-5 MS | 1204. | Zouari, Ayadi, et al., 2012 | 30. m/0.25 mm/0.25 μm, Helium, 50. C @ 1. min, 7. K/min, 250. C @ 5. min |
Capillary | HP-1 | 1204. | Alizadeh, Khosh-Khui, et al., 2011 | 30. m/0.25 mm/0.25 μm, Helium, 3. K/min; Tstart: 60. C; Tend: 240. C |
Capillary | CP-Sil 5 CB | 1193. | Mothana, Hasson, et al., 2011 | 30. m/0.25 mm/0.26 μm, Nitrogen, 3. K/min, 280. C @ 22. min; Tstart: 45. C |
Capillary | HP-5 MS | 1213. | Radulovic, Blagojevic, et al., 2010 | 30. m/0.25 mm/0.25 μm, Helium, 5. K/min, 290. C @ 10. min; Tstart: 70. C |
Capillary | DB-1-MS | 1185. | Takeoka, Hobbs, et al., 2010 | 60. m/0.25 mm/0.25 μm, Helium, 30. C @ 4. min, 2. K/min, 200. C @ 35. min |
Capillary | SPB-5 | 1213. | Gauvin-Bialecki and Marodon, 2009 | 60. m/0.35 mm/0.25 μm, Nitrogen, 4. K/min, 230. C @ 40. min; Tstart: 60. C |
Capillary | HP-5 | 1208. | Maridass, 2009 | 25. m/0.20 mm/0.33 μm, Helium, 3. K/min, 240. C @ 7. min; Tstart: 60. C |
Capillary | RTX-1 | 1191. | Museli, Pau, et al., 2009 | 60. m/0.22 mm/0.25 μm, Helium, 2. K/min, 230. C @ 30. min; Tstart: 60. C |
Capillary | RTX-1 | 1193. | Museli, Pau, et al., 2009 | 60. m/0.22 mm/0.25 μm, Helium, 2. K/min, 230. C @ 30. min; Tstart: 60. C |
Capillary | HP-5 | 1214. | Zhannan, Shiqiong, et al., 2009 | 30. m/0.32 mm/0.25 μm, Helium, 40. C @ 4. min, 4. K/min; Tend: 240. C |
Capillary | SLB-5 MS | 1209. | Lo Presti, Sciarrone, et al., 2008 | 30. m/0.25 mm/0.25 μm, Helium, 50. C @ 2. min, 3. K/min, 250. C @ 10. min |
Capillary | DB-5 | 1214. | Mosayebi, Amin, et al., 2008 | 60. m/0.25 mm/0.25 μm, Nitrogen, 5. K/min, 250. C @ 10. min; Tstart: 60. C |
Capillary | HP-5 MS | 1205. | Adams, Beauchamp, et al., 2007 | 30. m/0.25 mm/0.25 μm, Helium, 50. C @ 10. min, 3. K/min, 230. C @ 10. min |
Capillary | HP-5 | 1205. | Cheraif, Ben Jannet, et al., 2007 | 30. m/0.25 mm/0.25 μm, N2, 50. C @ 1. min, 5. K/min, 240. C @ 4. min |
Capillary | DB-5 | 1207. | Ghasemi, Yamini, et al., 2007 | 30. m/0.25 mm/0.25 μm, He, 60. C @ 3. min, 30. K/min; Tend: 210. C |
Capillary | ZB-5 | 1208. | Mohottalage, Tabacchi, et al., 2007 | 30. m/0.25 mm/0.25 μm, 60. C @ 5. min, 4. K/min, 220. C @ 20. min |
Capillary | HP-5MS | 1177. | Tzakou, Bazos, et al., 2007 | 30. m/0.25 mm/0.25 μm, He, 3. K/min; Tstart: 60. C; Tend: 280. C |
Capillary | SPB-1 | 1187. | Cavaleiro, Pinto, et al., 2006 | 30. m/0.20 mm/0.20 μm, Helium, 3. K/min, 220. C @ 15. min; Tstart: 70. C |
Capillary | HP-5 | 1209. | Coronel, Cerda-Garcia-Rojas, et al., 2006 | 30. m/0.32 mm/0.25 μm, He, 3. K/min; Tstart: 60. C; Tend: 246. C |
Capillary | HP-5MS | 1209. | Ebrahim Sajjadi and Mehregan, 2006 | 30. m/0.25 mm/0.25 μm, 4. K/min; Tstart: 60. C; Tend: 280. C |
Capillary | CP Sil 5 CB | 1192. | Lis and Milczarek, 2006 | 30. m/0.32 mm/0.25 μm, N2, 4. K/min; Tstart: 50. C; Tend: 300. C |
Capillary | HP-5 | 1211. | Pintore G., Chessa M., et al., 2006 | 30. m/0.25 mm/0.25 μm, He, 60. C @ 10. min, 5. K/min; Tend: 220. C |
Capillary | DB-5 | 1204. | Pino, Marbot, et al., 2006 | 30. m/0.25 mm/0.25 μm, Hydrogen, 70. C @ 4. min, 4. K/min; Tend: 280. C |
Capillary | DB-5 | 1207. | Pino, Marbot, et al., 2006 | 30. m/0.25 mm/0.25 μm, Hydrogen, 70. C @ 4. min, 4. K/min; Tend: 280. C |
Capillary | HP-5 | 1207. | Potzernheim, Bizzo, et al., 2006 | 25. m/0.32 mm/0.25 μm, H2, 3. K/min; Tstart: 60. C; Tend: 240. C |
Capillary | DB-5 | 1214. | Sabulal, Dan, et al., 2006 | 30. m/0.25 mm/0.25 μm, He, 5. K/min; Tstart: 60. C; Tend: 260. C |
Capillary | DB-1 | 1192. | Sonboli, Mirjalili, et al., 2006 | 60. m/0.25 mm/0.25 μm, Helium, 5. K/min, 250. C @ 10. min; Tstart: 60. C |
Capillary | HP-5 | 1216. | Wang, Yang, et al., 2006 | 30. m/0.25 mm/0.25 μm, He, 60. C @ 2. min, 10. K/min, 250. C @ 10. min |
Capillary | DB-5 | 1209. | Chaverri and Cicció, 2005 | 30. m/0.25 mm/0.25 μm, He, 3. K/min; Tstart: 60. C; Tend: 240. C |
Capillary | HP-5 | 1210. | Oyedeji, Yani, et al., 2005 | 30. m/0.25 mm/0.25 μm, He, 5. K/min; Tstart: 70. C; Tend: 240. C |
Capillary | DB-5 | 1208. | Skoula and Grayer, 2005 | 30. m/0.25 mm/0.25 μm, He, 3. K/min, 230. C @ 20. min; Tstart: 60. C |
Capillary | DB-1 | 1192. | Sonboli, Salehi, et al., 2005 | 60. m/0.25 mm/0.25 μm, He, 5. K/min, 250. C @ 10. min; Tstart: 60. C |
Capillary | HP-5MS | 1183. | Tzakou, Bazos, et al., 2005 | 30. m/0.25 mm/0.25 μm, He, 3. K/min; Tstart: 60. C; Tend: 280. C |
Capillary | DB-1 | 1177. | Velasco-Negueruela, Pérez-Alonso, et al., 2005 | 50. m/0.25 mm/0.25 μm, 3. K/min; Tstart: 60. C; Tend: 240. C |
Capillary | DB-5 | 1205. | Tellez, Khan, et al., 2004 | 30. m/0.25 mm/0.25 μm, He, 3. K/min; Tstart: 60. C; Tend: 240. C |
Capillary | DB-5 | 1215. | Edris and Farrag, 2003 | He, 3. K/min; Column length: 60. m; Column diameter: 0.32 mm; Tstart: 50. C; Tend: 220. C |
Capillary | DB-5 | 1206. | Edris, Shalaby, et al., 2003 | He, 3. K/min; Column length: 60. m; Column diameter: 0.32 mm; Tstart: 50. C; Tend: 200. C |
Capillary | CP Sil 5 CB | 1187. | Kanjilal, Kotoky, et al., 2003 | 25. m/0.25 mm/0.25 μm, He, 35. C @ 2.5 min, 5. K/min; Tend: 280. C |
Capillary | DB-5MS | 1211. | Maia, Taveira, et al., 2003 | 30. m/0.25 mm/0.25 μm, He, 3. K/min; Tstart: 60. C; Tend: 240. C |
Capillary | DB-5 | 1208. | Masotti, Juteau, et al., 2003 | 50. m/0.2 mm/0.25 μm, He, 50. C @ 2. min, 3. K/min; Tend: 220. C |
Capillary | DB-1 | 1196. | Perez-Alonso, Velasco-Negueruela, et al., 2003 | 50. m/0.25 mm/0.25 μm, N2, 4. K/min; Tstart: 95. C; Tend: 240. C |
Capillary | DB-5 | 1205. | Pino, Marbot, et al., 2003 | 30. m/0.25 mm/0.25 μm, H2, 60. C @ 10. min, 4. K/min, 280. C @ 40. min |
Capillary | HP-5 | 1195. | Pitarokili, Tzakou, et al., 2003 | 30. m/0.25 mm/0.25 μm, He, 3. K/min; Tstart: 60. C; Tend: 280. C |
Capillary | DB-1 | 1192. | Shahmir, Ahmadi, et al., 2003 | 60. m/0.25 mm/0.25 μm, He, 4. K/min; Tstart: 50. C; Tend: 280. C |
Capillary | DB-5 | 1205. | Bos, Koulman, et al., 2002 | 30. m/0.249 mm/0.25 μm, He, 3. K/min, 300. C @ 5. min; Tstart: 60. C |
Capillary | HP-1 | 1187. | Cavaleiro, Salgueiro, et al., 2002 | 30. m/0.25 mm/0.25 μm, He, 3. K/min, 220. C @ 15. min; Tstart: 70. C |
Capillary | 5 % Phenyl methyl siloxane | 1208. | Cicció and Gómez-Laurito, 2002 | 30. m/0.25 mm/0.25 μm, He, 75. C @ 4. min, 3. K/min, 200. C @ 8. min |
Capillary | HP-5 | 1204. | Ghannadi, Sajjadi, et al., 2002 | 30. m/0.25 mm/0.25 μm, He, 4. K/min; Tstart: 60. C; Tend: 275. C |
Capillary | DB-1 | 1202. | Norouzi-Arasi, Yavari, et al., 2002 | 30. m/0.25 mm/0.25 μm, He, 60. C @ 10. min, 4. K/min; Tend: 250. C |
Capillary | HP-5 | 1214. | Novak, Langbehn, et al., 2002 | 30. m/0.25 mm/0.25 μm, 3. K/min; Tstart: 60. C; Tend: 240. C |
Capillary | HP-5 | 1207. | Flamini, Cioni, et al., 2001 | 30. m/0.25 mm/0.25 μm, N2, 60. C @ 10. min, 5. K/min; Tend: 220. C |
Capillary | RTX-1 | 1195. | Kalemba, 1999 | 30. m/0.25 mm/0.25 μm, N2, 4. K/min; Tstart: 60. C; Tend: 300. C |
Capillary | DB-1 | 1205. | Koulman, 1999 | 25. m/0.25 mm/0.25 μm, He, 4. K/min; Tstart: 50. C; Tend: 290. C |
Capillary | DB-5MS | 1210. | Zoghbi, Andrade, et al., 1999 | 30. m/0.25 mm/0.25 μm, He, 3. K/min; Tstart: 60. C; Tend: 240. C |
Capillary | SPB-5 | 1209. | Doneanu and Anitescu, 1998 | 50. m/0.32 mm/0.25 μm, He, 3. K/min, 240. C @ 20. min; Tstart: 60. C |
Capillary | DB-5 | 1206. | Maia, Zohhbi, et al., 1998 | 30. m/0.25 mm/0.25 μm, He, 3. K/min; Tstart: 60. C; Tend: 240. C |
Capillary | BP-1 | 1185. | Brophy, Davies, et al., 1989 | H2, 40. C @ 1. min, 10. K/min; Column length: 50. m; Column diameter: 0.30 mm; Tend: 250. C |

Normal alkane RI, non-polar column, custom temperature program

Column type | Active phase | I | Reference | Comment |
---|---|---|---|---|
Capillary | DB-1-MS | 1185. | Takeoka, Hobbs, et al., 2010 | 60. m/0.25 mm/0.25 μm, Helium; Program: not specified |
Capillary | DB-1 | 1197. | Delort and Jaquier, 2009 | 60. m/0.25 mm/0.25 μm, Helium; Program: 50 0C (5 min) 3 0C/min -> 120 0C 5 0C/min -> 250 0C (3 min) 15 0C/min -> 300 0C (20 min) |
Capillary | SLB-5 MS | 1209. | Costa, De Fina, et al., 2008 | 30. m/0.25 mm/0.25 μm, Helium; Program: 50 0C 3 0C/min -> 250 0C (1 min) 10 0C/min -> 300 0C (5 min) |
Capillary | SLB-5 MS | 1207. | Costa, De Fina, et al., 2008 | 30. m/0.25 mm/0.25 μm, Helium; Program: not specified |
Capillary | SLB-5 MS | 1208. | Lo Presti, Sciarrone, et al., 2008 | 30. m/0.25 mm/0.25 μm, Helium; Program: not specified |
Capillary | RTX-5 | 1211. | Zachariah, Leela, et al., 2008 | 30. m/0.25 mm/0.25 μm, Helium; Program: 60 0C (5 min) 5 0C/min -> 110 0C 3 0C/min -> 220 0C (5 min) |
Capillary | RTX-5 | 1208. | Zachariah, Leela, et al., 2008 | 30. m/0.25 mm/0.25 μm, Helium; Program: not specified |
Capillary | HP-5MS | 1206. | Cole, Haber, et al., 2007 | 30. m/0.25 mm/0.25 μm, He; Program: 40C(10min) => 3C/min => 200C => 2C/min => 220C |
Capillary | DB-5 | 1208. | Nivinsliene, Butkiene, et al., 2007 | 50. m/0.32 mm/0.25 μm, Helium; Program: 60 0C (1 min) 5 0C/min -> 160 0C 10 0C/min -> 250 0C |
Capillary | DB-5 | 1211. | Pontes, de Oliveira, et al., 2007 | 30. m/0.25 mm/0.25 μm, Hydrogen; Program: 35 0C (2 min) 4 0C/min -> 180 0C 20 0C -> 280 0C |
Capillary | BPX-5 | 1193. | Salamci, Kordali, et al., 2007 | 30. m/0.25 mm/0.25 μm, He; Program: 50C => 3C/min => 150C(10min) => 10C/min => 250C |
Capillary | BPX-5 | 1192. | Baris, Güllüce, et al., 2006 | 30. m/0.25 mm/0.25 μm, He; Program: 50C => 3C/min => 150C(10min) => 10C/min => 250C |
Capillary | CP Sil 8 CB | 1208. | Butkienë, Nivinskienë, et al., 2005 | 50. m/0.32 mm/0.25 μm, He; Program: 50C(5min) => 2C/min => 90C => 15C/min => 240C(4min) |
Capillary | BPX-5 | 1205. | Judzentiene and Mockute, 2005 | 30. m/0.25 mm/0.25 μm; Program: 60C(0.2min) => 3K/min => 186C => 10C/min => 240C (5min) |
Capillary | DB-1 | 1204. | Omidbaigi and Bastan, 2005 | Program: not specified |
Capillary | CP Sil 8 CB | 1208. | Radudienë, Judpintienë, et al., 2005 | 50. m/0.32 mm/0.25 μm, He; Program: 60C(2min) => 5C/min => 160C(1min) => 10C/min => 250C (3min) |
Capillary | 1188. | El-Shazily, Hafez, et al., 2004 | Program: not specified | |
Capillary | OV-1 | 1188. | Hafez and Abdel-Salam, 2004 | 30. m/0.25 mm/0.25 μm, He; Program: 45 0C (4 min) 3 0C/min -> 75 0C 4 0C/min -> 115 0C 6 0C/min -> 312 0C |
Capillary | SE-30 | 1202. | Vinogradov, 2004 | Program: not specified |
Capillary | CP Sil 8 CB | 1205. | Mockute and Judzentiene, 2003 | 50. m/0.32 mm/0.25 μm, He; Program: 70C(5min) => 3C/min => 100C (1min) => 25C/min => 250C (10min) |
Capillary | CP Sil 5 CB | 1192. | Weyerstahl, Marschall, et al., 1999 | Column length: 25. m; Column diameter: 0.39 mm; Program: not specified |
Capillary | Polydimethyl siloxanes | 1195. | Zenkevich, 1997 | Program: not specified |

Normal alkane RI, polar column, temperature ramp

Column type | Active phase | I | Reference | Comment |
---|---|---|---|---|
Capillary | Supelcowax | 1749. | Gauvin-Bialecki and Marodon, 2009 | 60. m/0.35 mm/0.25 μm, Nitrogen, 4. K/min, 230. C @ 40. min; Tstart: 60. C |
Capillary | RTX-Wax | 1709. | Museli, Pau, et al., 2009 | 60. m/0.22 mm/0.25 μm, Helium, 2. K/min, 230. C @ 30. min; Tstart: 60. C |
Capillary | HP-Innowax | 1675. | Cheraif, Ben Jannet, et al., 2007 | 30. m/0.25 mm/0.25 μm, N2, 50. C @ 1. min, 5. K/min, 240. C @ 4. min |
Capillary | DB-Wax | 1743. | Lee, Umano, et al., 2005 | 30. m/0.25 mm/0.25 μm, He, 3. K/min, 180. C @ 40. min; Tstart: 50. C |
Capillary | DB-Wax | 1686. | Choi, 2004 | 60. m/0.25 mm/0.25 μm, N2, 70. C @ 2. min, 2. K/min, 230. C @ 20. min |
Capillary | DB-Wax | 1693. | Tu, Thanh, et al., 2002 | 60. m/0.25 mm/0.25 μm, N2, 2. K/min; Tstart: 70. C; Tend: 230. C |
Capillary | NB-351 | 1689. | Onocha, Ekundayo, et al., 1999 | 25. m/0.3 mm/0.5 μm, H2, 70. C @ 2. min, 5. K/min; Tend: 250. C |
Capillary | FFAP | 1705. | Brophy, Davies, et al., 1989 | 50. C @ 1. min, 10. K/min; Column length: 50. m; Tend: 180. C |

Normal alkane RI, polar column, custom temperature program

Column type | Active phase | I | Reference | Comment |
---|---|---|---|---|
Capillary | HP Innowax FSP | 1689. | Tabanca N., Demirci B., et al., 2007 | 60. m/0.25 mm/0.25 μm, N2; Program: 60C(10min) => 4C/min => 220C(10min) => 1C/min => 240C |
Capillary | Innowax FSC | 1689. | Iscan, Kirimer, et al., 2006 | 60. m/0.25 mm/0.25 μm, N2; Program: 60C(10min) => 4C/min => 220C(10min) => 1C/min => 240C |
Capillary | HP-Innowax FSC | 1689. | Suleimenov Y.M., Atazhanova G.A., et al., 2006 | 60. m/0.25 mm/0.25 μm, He; Program: 60(10min) => 4C/min => 220C(10min) => 1C/min => 240C |
Capillary | HP-Innowax | 1689. | Demirci, Demirci, et al., 2005 | 60. m/0.25 mm/0.25 μm, N2; Program: 60C(10min) => 4C/min => 220C (10min) => 1C/min => 240C |
Capillary | HP-Innowax FSC | 1689. | Demirci, Paper, et al., 2004 | 60. m/0.25 mm/0.25 μm, He; Program: 60C(10min) => 4C/min => 220C(10min) => 1C/min => 240C |
Capillary | Carbowax 20M | 1710. | Vinogradov, 2004 | Program: not specified |
Capillary | Carbowax | 1676. | Edris, Shalaby, et al., 2003 | Program: not specified |
Capillary | Innowax FSC | 1689. | Tunalier, Kirimer, et al., 2002 | 60. m/0.25 mm/0.25 μm; Program: 60C(10min) => 4C/min => 220C(10min) => 1C/min => 240C |
Capillary | HP-Innowax | 1689. | Baser, Demirci, et al., 2001 | 60. m/0.25 mm/0.25 μm, He; Program: 60 0C (10 min) 10 K/min -> 220 0C (10 min) 1K/min -> 240 0C |
Capillary | HP-Innowax | 1689. | Gören, Demirci, et al., 2001 | 60. m/0.25 mm/0.25 μm, He; Program: 60 0C (10 min) 4 K/min -> 220 0C (10 min) 1 K/min -> 240 0C |
Capillary | Innowax | 1690. | Özcan, Akgül, et al., 2001 | 60. m/0.25 mm/0.25 μm, He; Program: 60C(10min) => 4C/min => 200C(10min) => 1C/min => 240C |

References

Adams, González Elizondo, et al., 2006
Adams, R.P.; González Elizondo, M.S.; González Elizondo, M.; Slinkman, E.,
DNA fingerprinting and terpenoid analysis of Juniperus blancoi var. huehuentensis (Cupressaceae), a new subalpine variety from Durango, Mexico,
Biochem. Syst. Ecol., 2006, 34, 3, 205-211, https://doi.org/10.1016/j.bse.2005.11.004
. [all data]
Sylvestre, Pichette, et al., 2006
Sylvestre, M.; Pichette, A.; Longtin, A.; Nagau, F.; Legault, J.,
Essential oil analysis and anticancer activity of leaf essential oil of Croton flavens L. from Guadeloupe,
J. Ethnopharmacol., 2006, 103, 1, 99-102, https://doi.org/10.1016/j.jep.2005.07.011
. [all data]
Adams and Nguyen, 2005
Adams, R.P.; Nguyen, S.,
Infra-specific variation in Juniperus deppeana and F. Sperryi in the Davis Mountains of Texas: variation in leaf essential oils and random amplified polymorphic DNAS (RAPDS),
Phytologia, 2005, 87, 2, 96-108. [all data]
Asuming, Beauchamp, et al., 2005
Asuming, W.A.; Beauchamp, P.S.; Descalzo, J.T.; Dev, B.C.; Dev, V.; Frost, S.; Ma, C.W.,
Essential oil composition of four Lomatium Raf. species and their chemotaxonomy,
Biochem. Syst. Ecol., 2005, 33, 1, 17-26, https://doi.org/10.1016/j.bse.2004.06.005
. [all data]
Baranauskiene, Venskutonis, et al., 2005
Baranauskiene, R.; Venskutonis, R.P.; Demyttenaere, J.C.R.,
Sensory and instrumental evaluation of sweet marjoram (Origanum majorana L.) aroma,
Flavour Fragr. J., 2005, 20, 5, 492-500, https://doi.org/10.1002/ffj.1478
. [all data]
Avato, Raffo, et al., 2004
Avato, P.; Raffo, F.; Aldouri, N.A.; Vartanian, S.T.,
Essential oils of varthemia iphionoides from Jordan,
Flavour Fragr. J., 2004, 19, 6, 559-561, https://doi.org/10.1002/ffj.1351
. [all data]
Lopes, Strobl, et al., 2004
Lopes, D.; Strobl, H.; Kolodziejczyk, P.,
14-Methylpentadecano-15-lactone (Muscolide): a new macrocyclic lactone from the oil of Angelica archangelica L.,
Chemistry and Biodiversity, 2004, 1, 12, 1880-1887, https://doi.org/10.1002/cbdv.200490144
. [all data]
Ogunwande, Olawore, et al., 2003
Ogunwande, I.A.; Olawore, N.O.; Adeleke, K.A.; Ekundayo, O.; Koenig, W.A.,
Chemical composition of the leaf volatile oil of Psidium guajava L. growing in Nigeria,
Flavour Fragr. J., 2003, 18, 2, 136-138, https://doi.org/10.1002/ffj.1175
. [all data]
Palá-Paúl, Velasco-Negueruela, et al., 2002
Palá-Paúl, J.; Velasco-Negueruela, A.; Pérez-Alonso, M.J.; Sanz, J.,
Essential oil composition of the aerial parts of Cachrys sicula L.,
Flavour Fragr. J., 2002, 17, 1, 64-68, https://doi.org/10.1002/ffj.1042
. [all data]
Adams, 2000
Adams, R.P.,
Systematics of smooth leaf margin Juniperus of the western hemisphere based on leaf essential oils and RAPD DNA fingerprinting,
Biochem. Syst. Ecol., 2000, 28, 2, 149-162, https://doi.org/10.1016/S0305-1978(99)00047-2
. [all data]
Adams, 2000, 2
Adams, R.P.,
Systematics of the one seeded Juniperus of the eastern hemisphere based on leaf essential oils and random amplified polymorphic DNAs (RAPDs),
Biochem. Syst. Ecol., 2000, 28, 6, 529-543, https://doi.org/10.1016/S0305-1978(99)00096-4
. [all data]
Adams, 2000, 3
Adams, R.P.,
The serrate leaf margined Juniperus (Section Sabina) of the western hemisphere: systematics and evolution based on leaf essential oils and Random Amplified Polymorphic DNAs (RAPDs),
Biochem. Syst. Ecol., 2000, 28, 10, 975-989, https://doi.org/10.1016/S0305-1978(00)00022-3
. [all data]
Adams, 1999
Adams, R.P.,
Systematics of multi-seeded eastern hemisphere Juniperus based on leaf essential oils and RAPD DNA fingerprinting,
Biochem. Syst. Ecol., 1999, 27, 7, 709-725, https://doi.org/10.1016/S0305-1978(99)00016-2
. [all data]
Vera and Chane-Ming, 1999
Vera, R.R.; Chane-Ming, J.,
Chemical composition of the essential oil of marjoram (Origanum majorana L.) from Reunion Island,
Food Chem., 1999, 66, 2, 143-145, https://doi.org/10.1016/S0308-8146(98)00018-1
. [all data]
Tuberoso, Kowalczyk, et al., 2005
Tuberoso, C.I.G.; Kowalczyk, A.; Coroneo, V.; Russo, M.T.; Dessì, S.; Cabras, P.,
Chemical Composition and Antioxidant, Antimicrobial, and Antifungal Activities of the Essential Oil of Achillea ligustica All.,
J. Agric. Food Chem., 2005, 53, 26, 10148-10153, https://doi.org/10.1021/jf0518913
. [all data]
Dwivedi, Khan, et al., 2004
Dwivedi, S.; Khan, M.; Srivastava, S.K.; Syamasunnder, K.V.; Srivastava, A.,
Essential oil composition of different accessions of Mentha × piperita L. grown on the northern plains of India,
Flavour Fragr. J., 2004, 19, 5, 437-440, https://doi.org/10.1002/ffj.1333
. [all data]
Sibanda, Chigwada, et al., 2004
Sibanda, S.; Chigwada, G.; Poole, M.; Gwebu, E.T.; Noletto, J.A.; Schmidt, J.M.; Rea, A.I.; Setzer, W.N.,
Composition and bioactivity of the leaf essential oil of Heteropyxis dehniae from Zimbabwe,
J. Ethnopharmacol., 2004, 92, 1, 107-111, https://doi.org/10.1016/j.jep.2004.02.010
. [all data]
Santos, Andrade, et al., 1998
Santos, A.S.; Andrade, E.H.A.; Zoghbi, M.G.B.; Maia, J.G.S.,
Volatile constituents of fruits of Annona glabra L. from Brazil,
Flavour Fragr. J., 1998, 13, 3, 148-150, https://doi.org/10.1002/(SICI)1099-1026(199805/06)13:3<148::AID-FFJ711>3.0.CO;2-Y
. [all data]
Benkaci-Ali, Baaliouamer, et al., 2007
Benkaci-Ali, F.; Baaliouamer, A.; Meklati, B.Y.; Chemat, F.,
Chemical composition of seed essential oils from Algerian Nigella sativa extracted by microwave and hydrodistillation,
Flavour Fragr. J., 2007, 22, 2, 148-153, https://doi.org/10.1002/ffj.1773
. [all data]
Lesueur, de Rocca Serra, et al., 2007
Lesueur, D.; de Rocca Serra, D.; Bighelli, A.; Hoi, T.M.; Ban, N.K.; Thai, T.H.; Casanova, J.,
Chemical composition and antibacterial activity of the essential oil of Michelia foveolata Merryll ex Dandy from Vietnam,
Flavour Fragr. J., 2007, 22, 4, 317-321, https://doi.org/10.1002/ffj.1799
. [all data]
Quijano, Salamanca, et al., 2007
Quijano, C.E.; Salamanca, G.; Pino, J.A.,
Aroma volatile constituents of Colombian varieties of mango (Mangifera indica L.),
Flavour Fragr. J., 2007, 22, 5, 401-406, https://doi.org/10.1002/ffj.1812
. [all data]
Andrianoelisoa H.S., Menut C., et al., 2006
Andrianoelisoa H.S.; Menut C.; de Chatelperron P.C.; Saracco J.; Ramanoelina P.; Danthu P.,
Intraspecific chemical variability and highlighting of chemotypes of leaf essential oils from Ravensara aromatica Sonnerat a tree endemic to Madagascar,
Flavour Fragr. J., 2006, 21, 5, 833-838, https://doi.org/10.1002/ffj.1735
. [all data]
Gonny, Cavaleiro, et al., 2006
Gonny, M.; Cavaleiro, C.; Salgueiro, L.; Casanova, J.,
Analysis of Juniperus communis subsp. alpina needle, berry, wood and root oils by combination of GC, GC/MS and 13C-NMR,
Flavour Fragr. J., 2006, 21, 1, 99-106, https://doi.org/10.1002/ffj.1527
. [all data]
Pavlovic, Kovacevic, et al., 2006
Pavlovic, M.; Kovacevic, N.; Tzakou, O.; Couladis, M.,
Essential oil composition of Anthemis triumfetti (L.) DC.,
Flavour Fragr. J., 2006, 21, 2, 297-299, https://doi.org/10.1002/ffj.1592
. [all data]
Paolini, Costa, et al., 2005
Paolini, J.; Costa, J.; Bernardini, A.,
Analysis of the essential oil from aerial parts of Eupatorium cannabinum subsp. corsicum (L.) by gas chromatography with electron impact and chemical ionization mass spectrometry,
J. Chromatogr. A, 2005, 1076, 1-2, 170-178, https://doi.org/10.1016/j.chroma.2005.03.131
. [all data]
Dugo, Mondello, et al., 2004
Dugo, P.; Mondello, L.; Zappia, G.; Bonaccorsi, I.; Cotroneo, A.; Russo, M.T.,
The composition of the volatile fraction and the enantiomeric distribution of five volatile components of faustrime oil (Monocitrus australatica x Fortunella sp. x Citrus aurantifolia),
J. Essent. Oil Res., 2004, 16, 4, 328-333, https://doi.org/10.1080/10412905.2004.9698734
. [all data]
Flamini, Cioni, et al., 2004
Flamini, G.; Cioni, P.L.; Morelli, I.; Maccioni, S.; Baldini, R.,
Phytochemical typologies in some populations of Myrtus communis L. on Caprione Promontory (East Liguria, Italy),
Food Chem., 2004, 85, 4, 599-604, https://doi.org/10.1016/j.foodchem.2003.08.005
. [all data]
Javidnia, Miri, et al., 2004
Javidnia, K.; Miri, R.; Jafari, A.; Rezai, H.,
Analysis of the volatile constituents of Nepeta macrosiphon Boiss. grown in Iran,
Flavour Fragr. J., 2004, 19, 2, 156-158, https://doi.org/10.1002/ffj.1287
. [all data]
Mardarowicz, Wianowska, et al., 2004
Mardarowicz, M.; Wianowska, D.; Dawidowicz, A.L.; Sawicki, R.,
The influence of sample treatment on SPME extracts from conifers. I. Comparison of terpene composition in Engelmann Spruce (Picea engelmanii) using hydrodistillation, SPME and PLE,
Annales Universitatis Mariae Curie-Sklodowska Lublin - Polonia, 2004, 59, 3, 25-42. [all data]
Salido, Valenzuela, et al., 2004
Salido, S.; Valenzuela, L.R.; Altarejos, J.; Nogueras, M.; Sánchez, A.; Cano, E.,
Composition and infraspecific variability of Artemisia herba-alba from southern Spain,
Biochem. Syst. Ecol., 2004, 32, 3, 265-277, https://doi.org/10.1016/j.bse.2003.09.002
. [all data]
Sartoratto, Machado, et al., 2004
Sartoratto, A.; Machado, A.L.M.; Delarmelina, C.; Figueira, G.M.; Duarte, M.C.T.; Rehder, V.L.G.,
Composition and antimicrobial activity of essential oils from aromatic plants used in Brazil,
Braz. J. Microbiol., 2004, 35, 4, 275-280, https://doi.org/10.1590/S1517-83822004000300001
. [all data]
Stashenko, Jaramillo, et al., 2004
Stashenko, E.E.; Jaramillo, B.E.; Martínez, J.R.,
Analysis of volatile secondary metabolites from Colombian Xylopia aromatica (Lamarck) by different extraction and headspace methods and gas chromatography,
J. Chromatogr. A, 2004, 1025, 1, 105-113, https://doi.org/10.1016/j.chroma.2003.10.059
. [all data]
Bader, Flamini, et al., 2003
Bader, A.; Flamini, G.; Cioni, P.L.; Morelli, I.,
Essential oil composition of Achillea santolina L. and Achillea biebersteinii Afan. collected in Jordan,
Flavour Fragr. J., 2003, 18, 1, 36-38, https://doi.org/10.1002/ffj.1147
. [all data]
Shellie, Marriott, et al., 2003
Shellie, R.; Marriott, P.; Zappia, G.; Mondello, L.; Dugo, G.,
Interactive use of linear retention indices on polar and apolar columns with an MS-Library for reliable characterization of Australian tea tree and other Melaleuca sp. oils,
J. Essent. Oil Res., 2003, 15, 5, 305-312, https://doi.org/10.1080/10412905.2003.9698597
. [all data]
Tsiri, Kretsi, et al., 2003
Tsiri, D.; Kretsi, O.; Chinou, I.B.; Spyropoulos, C.G.,
Composition of fruit volatiles and annual changes in the volatiles of leaves of Eucalyptus camaldulensis Dehn. growing in Greece,
Flavour Fragr. J., 2003, 18, 3, 244-247, https://doi.org/10.1002/ffj.1220
. [all data]
Flamini, Cioni, et al., 2002
Flamini, G.; Cioni, P.L.; Morelli, I.,
Differences in the fragrances of pollen and different floral parts of male and female flowers of Laurus nobilis,
J. Agric. Food Chem., 2002, 50, 16, 4647-4652, https://doi.org/10.1021/jf020269x
. [all data]
Pino, Marbot, et al., 2002
Pino, J.A.; Marbot, R.; Bello, A.,
Volatile compounds of Psidium salutare (H.B.K.) Berg. fruit,
J. Agric. Food Chem., 2002, 50, 18, 5146-5148, https://doi.org/10.1021/jf0116303
. [all data]
Aligiannis, Kalpoutzakis, et al., 2001
Aligiannis, N.; Kalpoutzakis, E.; Mitaku, S.; Chinou, I.B.,
Composition and antimicrobial activity of the essential oils of two Origanum species,
J. Agric. Food Chem., 2001, 49, 9, 4168-4170, https://doi.org/10.1021/jf001494m
. [all data]
Rezzi, Cavaleiro, et al., 2001
Rezzi, S.; Cavaleiro, C.; Bighelli, A.; Salgueiro, L.; da Cunha, A.P.; Casanova, J.,
Intraspecific chemical variability of the leaf essential oil of Juniperus phoenicea subsp. turbinata from Corsica,
Biochem. Syst. Ecol., 2001, 29, 2, 179-188, https://doi.org/10.1016/S0305-1978(00)00044-2
. [all data]
Salido, Altarejos, et al., 2001
Salido, S.; Altarejos, J.; Nogueras, M.; Sánchez, A.,
Chemical composition of the essential oil of Artemisia herba-alba Asso ssp. valentina (Lam.) Marcl.,
J. Essent. Oil Res., 2001, 13, 4, 221-224, https://doi.org/10.1080/10412905.2001.9699675
. [all data]
Alonzo, Bosco, et al., 2000
Alonzo, G.; Bosco, S.F.D.; Palazzolo, E.; Saiano, F.; Tusa, N.,
Citrus somatic hybrid leaf essential oil,
Flavour Fragr. J., 2000, 15, 4, 258-262, https://doi.org/10.1002/1099-1026(200007/08)15:4<258::AID-FFJ906>3.0.CO;2-F
. [all data]
Bicchi, Rubiolo, et al., 1998
Bicchi, C.; Rubiolo, P.; Marschall, H.; Weyerstahl, P.; Laurent, R.,
Constituents of Artemisia roxburghiana Besser essential oil,
Flavour Fragr. J., 1998, 13, 1, 40-46, https://doi.org/10.1002/(SICI)1099-1026(199801/02)13:1<40::AID-FFJ688>3.0.CO;2-Z
. [all data]
Mariotti, Costa, et al., 1997
Mariotti, J.P.; Costa, J.; Bianchini, A.; Bernardini, A.F.; Casanova, J.,
Composition and variability of the essential oil of Stachys glutinosa L. from Corsica (France),
Flavour Fragr. J., 1997, 12, 3, 205-209, https://doi.org/10.1002/(SICI)1099-1026(199705)12:3<205::AID-FFJ636>3.0.CO;2-I
. [all data]
Píry, Príbela, et al., 1995
Píry, J.; Príbela, A.; Durcanská, J.; Farkas, P.,
Fractionation of volatiles from blackcurrant (Ribes nigrum L.) by different extractive methods,
Food Chem., 1995, 54, 1, 73-77, https://doi.org/10.1016/0308-8146(95)92665-7
. [all data]
Chung, Eiserich, et al., 1993
Chung, T.Y.; Eiserich, J.P.; Shibamoto, T.,
Volatile compounds isolated from edible Korean chamchwi (Aster scaber Thunb),
J. Agric. Food Chem., 1993, 41, 10, 1693-1697, https://doi.org/10.1021/jf00034a033
. [all data]
Le Quere and Latrasse, 1990
Le Quere, J.-L.; Latrasse, A.,
Composition of the Essential Oils of Blackcurrant Buds (Ribes nigrum L.),
J. Agric. Food Chem., 1990, 38, 1, 3-10, https://doi.org/10.1021/jf00091a001
. [all data]
Brophy, Goldsack, et al., 2000
Brophy, J.J.; Goldsack, R.J.; Punruckvong, A.; Bean, A.R.; Forster, P.I.; Lepschi, B.J.; Doran, J.C.; Rozefelds, A.C.,
Leaf essential oils of the genus Leptospermum (Myrtaceae) in eastern Australia. Part 7. Leptospermum petersonii, L. liversidgei and allies,
Flavour Fragr. J., 2000, 15, 5, 342-351, https://doi.org/10.1002/1099-1026(200009/10)15:5<342::AID-FFJ924>3.0.CO;2-V
. [all data]
Choi and Sawamura, 2000
Choi, H.-S.; Sawamura, M.,
Composition of the essential oil of Citrus tamurana Hort. ex Tanaka (Hyuganatsu),
J. Agric. Food Chem., 2000, 48, 10, 4868-4873, https://doi.org/10.1021/jf000651e
. [all data]
Jian-Yu, Zhu, et al., 2012
Jian-Yu, S.; Zhu, L.; Tian, Y.-J.,
Chemical composition and antimicrobial activities of essential oil of Matricaria songarica,
Int. J. Agriculture Biology, 2012, 14, 1, 107-110. [all data]
Zouari, Ayadi, et al., 2012
Zouari, N.; Ayadi, I.; Fakhfakh, N.; Rebai, A.; Zouari, S.,
Variations of chemical composition of essential oils in wild-populations of Thymus algeriensis Boiss et Reut., a North African endemic species,
Lipids in Health and Desease, 2012, 11, 1, 28-39, https://doi.org/10.1186/1476-511X-11-28
. [all data]
Alizadeh, Khosh-Khui, et al., 2011
Alizadeh, A.; Khosh-Khui, M.; Javidnia, K.; Firuzi, O.; Jokar, S.M.,
Chemical composition of the essential oil, total phenolic content and antioxidant activity in Origanum maiorana L. (Lamiaceae) cultivated in Iran,
Adv. Environ. Biol., 2011, 5, 8, 2326-2331. [all data]
Mothana, Hasson, et al., 2011
Mothana, R.A.A.; Hasson, S.S.; Schultze, W.; Mowitz, A.; Lindequist, U.,
Phytochemical composition and in vitro antimicrobial and antioxidant activities of essential oils of three endemic Soqotraen Boswellia species,
Food Chem., 2011, 126, 3, 1149-1154, https://doi.org/10.1016/j.foodchem.2010.11.150
. [all data]
Radulovic, Blagojevic, et al., 2010
Radulovic, N.; Blagojevic, P.; Palic, R.,
Comparative study of the leaf volatiles of Arctostaphylos uva-ursi (L.) Spreng. and Vaccinium vitis-idaea L. (Ericaceae),
Molecules, 2010, 15, 9, 6168-6185, https://doi.org/10.3390/molecules15096168
. [all data]
Takeoka, Hobbs, et al., 2010
Takeoka, G.R.; Hobbs, C.; Byeoung-Soo, P.,
Volatile constituents of the aerial parts of Salvia apiana Jepson,
J. Essential Oil. Res., 2010, 22, 3, 241-244, https://doi.org/10.1080/10412905.2010.9700314
. [all data]
Gauvin-Bialecki and Marodon, 2009
Gauvin-Bialecki, A.; Marodon, C.,
Essential oil of Ayapana triplinervis from Reunion island: a good natural source of thymohydroquinone dimethyl ether,
Biochem. Systematics Ecol., 2009, 36, 11, 853-858, https://doi.org/10.1016/j.bse.2008.09.006
. [all data]
Maridass, 2009
Maridass, M.,
Inter-generic relationships of Ocimum and Origanum based on GC-MS volatile oils data using software NTSPSpc version 2.0,
Ethnobotanical Leaflets, 2009, 13, 83-88. [all data]
Museli, Pau, et al., 2009
Museli, A.; Pau, M.; Desjobert, J.-M.; Foddai, M.; Usai, M.; Costa, J.,
Volatile constituents of Achllea ligustica All. by HS-SPME/GC/GC-MS. Comparison with essential oils obtained by hydrodistillation from Corsica and Sardinia,
Chromatographia, 2009, 69, 5/6, 575-585, https://doi.org/10.1365/s10337-008-0939-1
. [all data]
Zhannan, Shiqiong, et al., 2009
Zhannan, Y.; Shiqiong, L.; Quancai, P.; Chao, Z.; Zhengwen, Y.,
GC-MS analysis of the essential oil of Coral Ginger (Zingiber corallinum Hance) rhizome obtained by supercritical fluid extraction and steam distillation extraction,
Chromatographia, 2009, 69, 7/8, 785-790, https://doi.org/10.1365/s10337-009-0971-9
. [all data]
Lo Presti, Sciarrone, et al., 2008
Lo Presti, M.; Sciarrone, D.; Crupi, M.C.; Costa, R.; Ragusa, S.; Dugo, G.; Mondello, L.,
Evaliation of the volatile and chiral composition in Pistacia lentiscus L. essential oil,
Flavour Fragr. J., 2008, 23, 4, 249-257, https://doi.org/10.1002/ffj.1878
. [all data]
Mosayebi, Amin, et al., 2008
Mosayebi, M.; Amin, G.; Arzani, H.; Azarnivand, H.; Maleki, M.; Shafaghat, A.,
Effect of habitat on essential oil of Achillea filipendula L. in Iran,
Asian J. Plant Sci., 2008, 7, 8, 779-781, https://doi.org/10.3923/ajps.2008.779.781
. [all data]
Adams, Beauchamp, et al., 2007
Adams, R.P.; Beauchamp, P.S.; Dev, V.; Dutz, S.M.,
New Natural Products Isolated from One-Seeded Juniperus of the Southwestern United States: Isolation and Occurence of 2-Ethenyl-3-methyl Phanol and Its Derivatives,
J. Essent. Oil Res., 2007, 19, 2, 146-152, https://doi.org/10.1080/10412905.2007.9699247
. [all data]
Cheraif, Ben Jannet, et al., 2007
Cheraif, I.; Ben Jannet, H.; Hammami, M.; Khouja, M.L.; Mighri, Z.,
Chemical composition and antimicrobial activity of essential oils of Cupressus arizonica Greene,
Biochem. Syst. Ecol., 2007, 35, 12, 813-820, https://doi.org/10.1016/j.bse.2007.05.009
. [all data]
Ghasemi, Yamini, et al., 2007
Ghasemi, E.; Yamini, Y.; Bahramifar, N.; Sefidkon, F.,
Comparative analysis of the oil and supercritical CO2 extract of Artemisia sieberi,
J. Food Eng., 2007, 79, 1, 306-311, https://doi.org/10.1016/j.jfoodeng.2006.01.059
. [all data]
Mohottalage, Tabacchi, et al., 2007
Mohottalage, S.; Tabacchi, R.; Guerin, P.M.,
Components from Sri Lankan Piper betle L. leaf oil and their analogues showing toxicity against the housefly, Musca domestica,
Flavour Fragr. J., 2007, 22, 2, 130-138, https://doi.org/10.1002/ffj.1770
. [all data]
Tzakou, Bazos, et al., 2007
Tzakou, O.; Bazos, I.; Yannitsaros, A.,
Volatile metabolites of Pistacia atlantica Desf. from Greece,
Flavour Fragr. J., 2007, 22, 5, 358-362, https://doi.org/10.1002/ffj.1805
. [all data]
Cavaleiro, Pinto, et al., 2006
Cavaleiro, C.; Pinto, E.; Gonsales, M.J.; Salguero, L.,
Antifungal activity of Juniperus essential oils agains dermatophyte, Asrgillus and Candida strains,
J. Appl. Microbiol., 2006, 100, 6, 1333-1338, https://doi.org/10.1111/j.1365-2672.2006.02862.x
. [all data]
Coronel, Cerda-Garcia-Rojas, et al., 2006
Coronel, A. del.C.; Cerda-Garcia-Rojas, C.M.; Joseph-Nathan, P.; Catalán, C.A.N.,
Chemical composition, seasonal variation and a new sesquiterpene alcohol from the essential oil of Lippia integrifolia,
Flavour Fragr. J., 2006, 21, 5, 839-847, https://doi.org/10.1002/ffj.1736
. [all data]
Ebrahim Sajjadi and Mehregan, 2006
Ebrahim Sajjadi, S.; Mehregan, I.,
Volatile constituents of flowers and leaves of Anthemis hyalina,
Chem. Nat. Compd. (Engl. Transl.), 2006, 42, 5, 531-533, https://doi.org/10.1007/s10600-006-0207-2
. [all data]
Lis and Milczarek, 2006
Lis, A.; Milczarek, J.,
Chemical composition of the essential oils from fruits, leaves and flowers of Phellodendron sachalinense (Fr. Schmidt) Sarg.,
Flavour Fragr. J., 2006, 21, 4, 683-686, https://doi.org/10.1002/ffj.1662
. [all data]
Pintore G., Chessa M., et al., 2006
Pintore G.; Chessa M.; Manconi P.; Zanetti S.; Deriu A.; Tirillini B.,
Chemical composition and antimicrobial activities of essential oil of stachys glutinosa L. from Sardinia,
Natural Product Communications, 2006, 1, 12, 1133-1136. [all data]
Pino, Marbot, et al., 2006
Pino, J.A.; Marbot, R.; Payo, A.; Chao, D.; Herrera, P.,
Aromatic Plants from Western Cuba VII. Composition of the Leaf Oil of Psidium wrightii KRug et Urb., Lantana involucrata L., Cinnamonum montanum (Sw.) Berchtold et J. Persl. and Caesalpinia violacea (Mill.) Standley,
J. Essent. Oil. Res., 2006, 18, 2, 170-174, https://doi.org/10.1080/10412905.2006.9699058
. [all data]
Potzernheim, Bizzo, et al., 2006
Potzernheim, M.C.L.; Bizzo, H.R.; Vieira, R.F.,
Analysis of the essential oil of three species of Piper collected in the region of the Distrito Federal (Cerrado - Brazilian Savannah) and comparison with oils of plants from region of Paraty, State of Rio de Janeiro (Atlantic Rain Forest),
Brazilian Journal of Pharmacognosy, 2006, 16, 2, 246-251. [all data]
Sabulal, Dan, et al., 2006
Sabulal, B.; Dan, M.; Anil, J.J.; Kurup, R.; Pradeep, N.S.; Valsamma, R.K.; George, V.,
Caryophyllene-rich rhizome oil of Zingiber nimmonii from South India: Chemical characterization and antimicrobial activity,
Phytochemistry, 2006, 67, 22, 2469-2473, https://doi.org/10.1016/j.phytochem.2006.08.003
. [all data]
Sonboli, Mirjalili, et al., 2006
Sonboli, A.; Mirjalili, M.H.; Yousefzadi, M.,
Antimicrobial activity and composition of the essential oil of Cymbopogon Olivieri (Boiss.) Bor from Iran,
Iranian J. Pharm. Res., 2006, 1, 65-68. [all data]
Wang, Yang, et al., 2006
Wang, Q.; Yang, Y.; Zhao, X.; Zhu, B.; Nan, P.; Zhao, J.; Wang, L.; Chen, F.; Liu, Z.; Zhong, Y.,
Chemical variation in the essential oil of Ephedra sinica from Northeastern China,
Food Chem., 2006, 98, 1, 52-58, https://doi.org/10.1016/j.foodchem.2005.04.033
. [all data]
Chaverri and Cicció, 2005
Chaverri, C.; Cicció, J.F.,
Essential oil of trees of the genus Ocotea (Lauraceae) in Costa Rica. I. Ocotea brenesii,
Rev. Biol. Trop., 2005, 53, 3-4, 431-436, https://doi.org/10.15517/rbt.v53i3-4.14611
. [all data]
Oyedeji, Yani, et al., 2005
Oyedeji, O.A.; Yani, V.V.; Afolayan, A.J.,
Chemical composition of the essential oil from Arctotis arctotoides (L.F.) O. Hoffm. (syn. Vendium arctotoides Less.),
Flavour Fragr. J., 2005, 20, 2, 232-234, https://doi.org/10.1002/ffj.1437
. [all data]
Skoula and Grayer, 2005
Skoula, M.; Grayer, R.J.,
Volatile oils of Coridothymus capitatus, Satureja thymbra, Satureja spinosa and Thymbra calostachya (Lamiaceae) from Crete,
Flavour Fragr. J., 2005, 20, 6, 573-576, https://doi.org/10.1002/ffj.1489
. [all data]
Sonboli, Salehi, et al., 2005
Sonboli, A.; Salehi, P.; Allahyari, L.,
Essential oil composition of Nepeta involucrata from Iran,
Chem. Nat. Compd. (Engl. Transl.), 2005, 41, 6, 683-685, https://doi.org/10.1007/s10600-006-0011-z
. [all data]
Tzakou, Bazos, et al., 2005
Tzakou, O.; Bazos, I.; Yannitsaros, A.,
Essential oils of leaves, inflorescences and infructescences of spontaneous Cotinus coggygria Scop. from Greece,
Flavour Fragr. J., 2005, 20, 5, 531-533, https://doi.org/10.1002/ffj.1456
. [all data]
Velasco-Negueruela, Pérez-Alonso, et al., 2005
Velasco-Negueruela, A.; Pérez-Alonso, M.J.; Palá-Paúl, J.; Iñigo, A.; López, G.,
The volatile oil composition of the berries of Juniperus macrocarpa Sibth. and Sm., gathered in Spain,
J. Essent. Oil Res., 2005, 17, 1, 61-63, https://doi.org/10.1080/10412905.2005.9698831
. [all data]
Tellez, Khan, et al., 2004
Tellez, M.R.; Khan, I.A.; Schaneberg, B.T.; Crockett, S.L.; Rimando, A.M.; Kobaisy, M.,
Steam distillation-solid-phase microextraction for the detection of Ephedra sinica in herbal preparations,
J. Chromatogr. A, 2004, 1025, 1, 51-56, https://doi.org/10.1016/S0021-9673(03)01035-5
. [all data]
Edris and Farrag, 2003
Edris, A.E.; Farrag, E.S.,
Antifungal activity of peppermint and sweet basil essential oils and their major aroma constituents on some plant pathogenic fungi from the vapor phase,
Nahrung/Food, 2003, 47, 2, 117-121, https://doi.org/10.1002/food.200390021
. [all data]
Edris, Shalaby, et al., 2003
Edris, A.E.; Shalaby, A.; Fadel, H.M.,
Effect of organic agriculture practices on the volatile aroma components of some essential oil plants growing in Egypt II: sweet Marjoram (Origanum marjorana L.) essential oil,
Flavour Fragr. J., 2003, 18, 4, 345-351, https://doi.org/10.1002/ffj.1235
. [all data]
Kanjilal, Kotoky, et al., 2003
Kanjilal, P.B.; Kotoky, R.; Singh, R.S.,
Chemical composition of the leaf oil of Altingia excelsa Nornha,
Flavour Fragr. J., 2003, 18, 5, 449-450, https://doi.org/10.1002/ffj.1250
. [all data]
Maia, Taveira, et al., 2003
Maia, J.G.S.; Taveira, F.S.N.; Andrade, E.H.A.; da Silva, M.H.L.; Zoghbi, M.G.B.,
Essential oils of Lippia grandis Schau.,
Flavour Fragr. J., 2003, 18, 5, 417-420, https://doi.org/10.1002/ffj.1241
. [all data]
Masotti, Juteau, et al., 2003
Masotti, V.; Juteau, F.; Bessière, J.M.; Viano, J.,
Seasonal and phenological variations of the essential oil from the narrow endemic species Artemisia molinieri and its biological activities,
J. Agric. Food Chem., 2003, 51, 24, 7115-7121, https://doi.org/10.1021/jf034621y
. [all data]
Perez-Alonso, Velasco-Negueruela, et al., 2003
Perez-Alonso, M.J.; Velasco-Negueruela, A.; Palá-Paúl, J.; Sanz, J.,
Variations in the essential oil composition of Artemisia pedemontana gathered in Spain: chemotype camphor-1,8-cineole and chemotype davanone,
Biochem. Syst. Ecol., 2003, 31, 1, 77-84, https://doi.org/10.1016/S0305-1978(02)00082-0
. [all data]
Pino, Marbot, et al., 2003
Pino, J.A.; Marbot, R.; Fuentes, V.,
Characterization of volatiles in Bullock's heart (Annona reticulata L.) fruit cultivars from Cuba,
J. Agric. Food Chem., 2003, 51, 13, 3836-3839, https://doi.org/10.1021/jf020733y
. [all data]
Pitarokili, Tzakou, et al., 2003
Pitarokili, D.; Tzakou, O.; Loukis, A.; Harvala, C.,
Volatile metabolites from Salvia fruticosa as antifungal agents in soilborne pathogens,
J. Agric. Food Chem., 2003, 51, 11, 3294-3301, https://doi.org/10.1021/jf0211534
. [all data]
Shahmir, Ahmadi, et al., 2003
Shahmir, F.; Ahmadi, L.; Mirza, M.; Korori, S.A.A.,
Secretory elements of needles and berries of Juniperus communis L. ssp. communis and its volatile constituents,
Flavour Fragr. J., 2003, 18, 5, 425-428, https://doi.org/10.1002/ffj.1243
. [all data]
Bos, Koulman, et al., 2002
Bos, R.; Koulman, A.; Woerdenbag, H.J.; Quax, W.J.; Pras, N.,
Volatile components from Anthriscus sylvestris (L.) Hoffm.,
J. Chromatogr. A, 2002, 966, 1-2, 233-238, https://doi.org/10.1016/S0021-9673(02)00704-5
. [all data]
Cavaleiro, Salgueiro, et al., 2002
Cavaleiro, C.; Salgueiro, L.; Barroso, J.G.; Figueiredo, A.C.; Pedro, L.G.; Fontinha, S.S.; Bighelli, A.; Casanova, J.; Looman, A.; Scheffer, J.J.C.,
Composition of the essential oil of Juniperus cedrus Webb and Berth. grown on Madeira,
Flavour Fragr. J., 2002, 17, 2, 111-114, https://doi.org/10.1002/ffj.1061
. [all data]
Cicció and Gómez-Laurito, 2002
Cicció, J.F.; Gómez-Laurito, J.,
Volatile constituents of the leaves of Siparuna thecaphora (Siparunaceae) from Turrialba, Costa Rica,
Rev. Biol. Trop., 2002, 50, 3/4, 963-967. [all data]
Ghannadi, Sajjadi, et al., 2002
Ghannadi, A.; Sajjadi, S.E.; Beigihasan, A.,
Composition of the essential oil of Ferula ovina (Boiss.) Boiss. from Iran,
DARU, 2002, 10, 4, 165-167, retrieved from http://www1.tums.ac.ir/daru/Daru4%202002/Ghannadi.PDF. [all data]
Norouzi-Arasi, Yavari, et al., 2002
Norouzi-Arasi, H.; Yavari, I.; Ghaffarzadeh, F.; Mortazavi, M.-S.,
Volatile constituents of Cymbopogon olivieri (Boiss.) Bor from Iran,
Flavour Fragr. J., 2002, 17, 4, 272-274, https://doi.org/10.1002/ffj.1096
. [all data]
Novak, Langbehn, et al., 2002
Novak, J.; Langbehn, J.; Pank, F.; Franz. C.M.,
Essential oil compounds in a historical sample of marjoram (Origanum majorana L., Lamiaceae),
Flavour Fragr. J., 2002, 17, 3, 175-180, https://doi.org/10.1002/ffj.1077
. [all data]
Flamini, Cioni, et al., 2001
Flamini, G.; Cioni, P.L.; Morelli, I.; Maccioni, S.; Monti, G.,
Composition of the essential oil of Teucrium fruticans L. from the Maremma Regional Park (Tuscany, Italy),
Flavour Fragr. J., 2001, 16, 5, 367-369, https://doi.org/10.1002/ffj.1014
. [all data]
Kalemba, 1999
Kalemba, D.,
Constituents of the essential oil of Artemisia asiatica Nakai,
Flavour Fragr. J., 1999, 14, 3, 173-176, https://doi.org/10.1002/(SICI)1099-1026(199905/06)14:3<173::AID-FFJ805>3.0.CO;2-Q
. [all data]
Koulman, 1999
Koulman, A.,
Podophyllotoxin: a study of biosynthesis, evolution, function, and use of podophyllotoxin and related lignans, University Library Groningen, Nederlands, 1999, 188, retrieved from http://www.ub.rug.nl/eldoc/dis/science/a.koulman/. [all data]
Zoghbi, Andrade, et al., 1999
Zoghbi, M.G.B.; Andrade, E.H.A.; Maia, J.G.S.,
Volatile constituents from leaves and flowers of Alpinia speciosa K. Schum. and A. purpurata (Viell.) Schum.,
Flavour Fragr. J., 1999, 14, 6, 411-414, https://doi.org/10.1002/(SICI)1099-1026(199911/12)14:6<411::AID-FFJ854>3.0.CO;2-U
. [all data]
Doneanu and Anitescu, 1998
Doneanu, C.; Anitescu, G.,
Supercritical carbon dioxide extraction of Angelica archangelica L. root oil,
J. Supercrit. Fluids, 1998, 12, 1, 59-67, https://doi.org/10.1016/S0896-8446(97)00040-5
. [all data]
Maia, Zohhbi, et al., 1998
Maia, J.G.S.; Zohhbi, M.G.B.; Andrade, E.H.A.; Santos, A.S.; da Silva, M.H.L.; Luz, A.I.R.; Bastos, C.N.,
Constituents of the essential oil of Piper aduncum L. growing wild in the Amazon region,
Flavour Fragr. J., 1998, 13, 4, 269-272, https://doi.org/10.1002/(SICI)1099-1026(1998070)13:4<269::AID-FFJ744>3.0.CO;2-A
. [all data]
Brophy, Davies, et al., 1989
Brophy, J.J.; Davies, N.W.; Southwell, I.A.; Stiff, I.A.; Williams, L.R.,
Gas chromatographic quality control for oil of Melaleuca terpinen-4-ol type (Australian tea tree),
J. Agric. Food Chem., 1989, 37, 5, 1330-1335, https://doi.org/10.1021/jf00089a027
. [all data]
Delort and Jaquier, 2009
Delort, E.; Jaquier, A.,
Novel terpenyl esters from Australian finger lime (Citrus australasica) peel extract,
Flav. Fragr. J., 2009, 24, 3, 123-132, https://doi.org/10.1002/ffj.1922
. [all data]
Costa, De Fina, et al., 2008
Costa, R.; De Fina, M.R.; Valentino, M.R.; Rustaiyan, A.; Dugo, P.; Dugo, G.; Mondello, L.,
An investigation on the volatile composition of some Artemisia species from Iran,
Flavour Fragr. J., 2008, 24, 2, 75-82, https://doi.org/10.1002/ffj.1919
. [all data]
Zachariah, Leela, et al., 2008
Zachariah, T.J.; Leela, N.K.; Maya, K.M.; Rema, J.; Mathew, P.A.; Vipin, T.M.; Krishnamoorthy, B.,
Chemical composition of leaf oils of Myristica beddomeii (King), Myristica fragrans (Houtt.) and Myristica malabarica (Lamk.),
J. Spices Arom. Crops, 2008, 17, 1, 10-15. [all data]
Cole, Haber, et al., 2007
Cole, R.A.; Haber, W.A.; Setzer, W.N.,
Chemical composition of essential oils of seven species of Eugenia from Monteverde, Costa Rica,
Biochem. Syst. Ecol., 2007, 35, 12, 877-886, https://doi.org/10.1016/j.bse.2007.06.013
. [all data]
Nivinsliene, Butkiene, et al., 2007
Nivinsliene, O.; Butkiene, R.; Gudalevic, A.; Mockute, D.; Meskauskiene, V.; Grigaliunaite, B.,
Influence of urban environment on chemical composition of Tilia cordata essential oil,
Chemija, 2007, 18, 1, 44-49. [all data]
Pontes, de Oliveira, et al., 2007
Pontes, W.J.T.; de Oliveira, J.C.S.; da Camara, C.A.G.; Lopes, A.C.H.R.; Gondim, M.G.C.G.; de Oliveira, J.V.; Schwartz, M.O.E.,
Composition and acaricidal activity of the resin's essential oil of Protium bahianum Daly against two spotted spider mite (Tetranychus Urticae),
J. Essent. Oil Res., 2007, 19, 4, 379-383, https://doi.org/10.1080/10412905.2007.9699310
. [all data]
Salamci, Kordali, et al., 2007
Salamci, E.; Kordali, S.; Kotan, R.; Cakir, A.; Kaya, Y.,
Chemical compositions, antimicrobial and herbicidal effects of essential oils isolated from Turkish Tanacetum aucheranum and Tanacetum chiliophyllum var. chiliophyllum,
Biochem. Syst. Ecol., 2007, 35, 9, 569-581, https://doi.org/10.1016/j.bse.2007.03.012
. [all data]
Baris, Güllüce, et al., 2006
Baris, Ö.; Güllüce, M.; Sahin, F.; Özer, H.; Kilic, H.; Özkan, H.; Sökmen, M.; Özbek, T.,
Biological Activities of the Essential Oil and Methanol Extract of Achillea biebersteinii Afan. (Asteraceae),
Turk. J. Biol., 2006, 30, 65-73. [all data]
Butkienë, Nivinskienë, et al., 2005
Butkienë, R.; Nivinskienë, O.; Mockutë, D.,
α-Pinene chemotype of leaf (needle) essential oils of Juniperus communis L. growing wild in Vilnius district,
Chemija, 2005, 16, 1, 53-60. [all data]
Judzentiene and Mockute, 2005
Judzentiene, A.; Mockute, D.,
The inflorescence and leaf essential oils of Tanacetum vulgare L. var. vulgare growing wild in Lithuania,
Biochem. Syst. Ecol., 2005, 33, 5, 487-498, https://doi.org/10.1016/j.bse.2004.11.003
. [all data]
Omidbaigi and Bastan, 2005
Omidbaigi, R.; Bastan, M.R.,
Essential oil content and composition of marjoram cultivated in north of Iran,
JEOBP, 2005, 8, 1, 56-60. [all data]
Radudienë, Judpintienë, et al., 2005
Radudienë, J.; Judpintienë, A.; Peèiulytë, D.; Janulis, V.,
Chemical composition of essential oil and antimicrobial activity of Origanum vulgare,
Biologija, 2005, 4, 53-58. [all data]
El-Shazily, Hafez, et al., 2004
El-Shazily, A.M.; Hafez, S.S.; Wink, M.,
Comparative study of the essential oils and extracts of Achillea fragrantissima (Forssk.) Sch. Bip. and Achillea santolina L. (Asteraceae) from Egypt,
Pharmazie, 2004, 59, 226-230. [all data]
Hafez and Abdel-Salam, 2004
Hafez, S.S.; Abdel-Salam, H.A.,
chemical composition and antimicrobial activity of the volatile constituents of thuja occidentalis L. growing in Egipt,
Alexandria J. Pharm. Sci., 2004, 18, 1, 41-47. [all data]
Vinogradov, 2004
Vinogradov, B.A.,
Production, composition, properties and application of essential oils, 2004, retrieved from http://viness.narod.ru. [all data]
Mockute and Judzentiene, 2003
Mockute, D.; Judzentiene, A.,
The myrtenol chemotype of essential oil of Tanacetum vulgare L. var. vulgare (tansy) growing wild in the Vilnius region,
Chemija, 2003, 14, 2, 103-107. [all data]
Weyerstahl, Marschall, et al., 1999
Weyerstahl, P.; Marschall, H.; Splittgerber, U.; Son, P.T.; Giang, P.M.; Kaul, V.K.,
Constituents of the essential oil from the fruits of Zanthoxylum rhetsoides Drake from Vietnam and from the aerial parts of Zanthoxylum alatum Roxb. from India,
Flavour Fragr. J., 1999, 14, 4, 225-229, https://doi.org/10.1002/(SICI)1099-1026(199907/08)14:4<225::AID-FFJ818>3.0.CO;2-1
. [all data]
Zenkevich, 1997
Zenkevich, I.G.,
Analytical Parameters of Components of Essential Oils for their Chromatographic and Chromato-Spectral Identificaiton. Oxsigenated derivatives of Mono- and Sesquiterpene Hydrocarbons,
Rastit, Resursy (Rus.), 1997, 33, 1, 16-28. [all data]
Lee, Umano, et al., 2005
Lee, S.-J.; Umano, K.; Shibamoto, T.; Lee, K.-G.,
Identification of volatile components in basil (Ocimum basilicum L.) and thyme leaves (Thymus vulgaris L.) and their antioxidant properties,
Food Chem., 2005, 91, 1, 131-137, https://doi.org/10.1016/j.foodchem.2004.05.056
. [all data]
Choi, 2004
Choi, H.-S.,
Volatile constituents of satsuma mandarins growing in Korea,
Flavour Fragr. J., 2004, 19, 5, 406-412, https://doi.org/10.1002/ffj.1283
. [all data]
Tu, Thanh, et al., 2002
Tu, N.T.M.; Thanh, L.X.; Une, A.; Ukeda, H.; Sawamura, M.,
Volatile constituents of Vietnamese pummelo, orange, tangerine and lime peel oils,
Flavour Fragr. J., 2002, 17, 3, 169-174, https://doi.org/10.1002/ffj.1076
. [all data]
Onocha, Ekundayo, et al., 1999
Onocha, P.A.; Ekundayo, O.; Oyelola, O.; Laakso, I.,
Essential oils of Dacryodes edulis (G. Don) H. J. Lam (African pear),
Flavour Fragr. J., 1999, 14, 2, 135-139, https://doi.org/10.1002/(SICI)1099-1026(199903/04)14:2<135::AID-FFJ788>3.0.CO;2-L
. [all data]
Tabanca N., Demirci B., et al., 2007
Tabanca N.; Demirci B.; Crockett S.L.; Baser K.H.C.; Wedge D.E.,
Chemical composition and antifungal activity of Arnica longifolia, Aster hesperius, and Chrysothamnus nauseosus essential oils,
J. Agric. Food Chem., 2007, 55, 21, 8430-8435, https://doi.org/10.1021/jf071379c
. [all data]
Iscan, Kirimer, et al., 2006
Iscan, G.; Kirimer, N.; Kurkcuoglu, M.; Arabaci, T.; Kupeli, E.; Baser, K.H.C.,
Biological Activity and Composition of the Essential Oils of Achillea schischkinii Sosn. and Achillea aleppica DC. subsp. aleppica,
J. Agric. Food Chem., 2006, 54, 1, 170-173, https://doi.org/10.1021/jf051644z
. [all data]
Suleimenov Y.M., Atazhanova G.A., et al., 2006
Suleimenov Y.M.; Atazhanova G.A.; Ozek T.; Demirci B.; Kulyyasov A.T.; Adekenov S.M.; Baser K.H.C.,
Essential oil composition of three species of Achillea from Kazakhstan,
Chem. Nat. Compd. (Engl. Transl.), 2006, 37, 5, 447-450, https://doi.org/10.1023/A:1014471326724
. [all data]
Demirci, Demirci, et al., 2005
Demirci, B.; Demirci, F.; Baser, K.H.C.,
Headspace-SPME and hydrodistillation of two fragrant Artemisia sp.,
Flavour Fragr. J., 2005, 20, 4, 395-398, https://doi.org/10.1002/ffj.1426
. [all data]
Demirci, Paper, et al., 2004
Demirci, F.; Paper, D.H.; Franz, G.; Hüsnü Can Baser, K.,
Investigation of the origanum onites L. essential oil using the Chorioallantoic Membrane (CAM) assay,
J. Agric. Food Chem., 2004, 52, 2, 251-254, https://doi.org/10.1021/jf034850k
. [all data]
Tunalier, Kirimer, et al., 2002
Tunalier, Z.; Kirimer, N.; Baser, K.H.C.,
The composition of essential oils from various parts of Juniperus foetidissima,
Chem. Nat. Compd. (Engl. Transl.), 2002, 38, 1, 43-47, https://doi.org/10.1023/A:1015725630556
. [all data]
Baser, Demirci, et al., 2001
Baser, K.H.C.; Demirci, B.; Tabanca, N.; Özek, T.; Gören, N.,
Composition of the essential oils of Tanacetum armenum (DC.) Schultz Bip., T. balsamita L., T. chiliophyllum (Fisch. Mey.) Schultz Bip. var. chiliophyllum and T. haradjani (Rech. fil.) Grierson and the enantiomeric distribution of camphor and carvone,
Flavour Fragr. J., 2001, 16, 3, 195-200, https://doi.org/10.1002/ffj.977
. [all data]
Gören, Demirci, et al., 2001
Gören, N.; Demirci, B.; Baser, K.H.C.,
Composition of the essential oils of Tanacetum spp. from Turkey,
Flavour Fragr. J., 2001, 16, 3, 191-194, https://doi.org/10.1002/ffj.976
. [all data]
Özcan, Akgül, et al., 2001
Özcan, M.; Akgül, A.; Bascr, K.H.C.; Özck, T.; Tabanca, N.,
Essential oil composition of sea fennel (Crithmum maritimum) form Turkey,
Nahrung/Food, 2001, 45, 5, 353-356, https://doi.org/10.1002/1521-3803(20011001)45:5<353::AID-FOOD353>3.0.CO;2-4
. [all data]