2-Cyclohexen-1-ol, 3-methyl-6-(1-methylethyl)-, cis-
- Formula: C10H18O
- Molecular weight: 154.2493
- IUPAC Standard InChIKey: HPOHAUWWDDPHRS-NXEZZACHSA-N
- CAS Registry Number: 16721-38-3
- Chemical structure:
View 3d structure (requires JavaScript / HTML 5) - Stereoisomers:
- Other names: p-Menth-1-en-3-ol, cis-; cis-p-Menth-1-en-3-ol; cis-Piperitol; 6-Isopropyl-3-methyl-2-cyclohexen-1-ol-, cis-; (Z)-Piperitol; 2-Cyclohexen-1-ol, 3-methyl-6-(1-methylethyl)-, (1R,6S)-rel-; cis-6-(Isopropyl)-3-methylcyclohex-2-en-1-ol; cis-3-Methyl-6-isopropyl-2-cyclohexen-1-ol

Kovats' RI, non-polar column, temperature ramp

Column type | Active phase | I | Reference | Comment |
---|---|---|---|---|
Capillary | DB-5 | 1193. | Adams, González Elizondo, et al., 2006 | 30. m/0.26 mm/0.25 μm, He, 3. K/min; Tstart: 60. C; Tend: 246. C |
Capillary | SPB-1 | 1176. | Walde, Jyothirmayi, et al., 2006 | 30. m/0.32 mm/0.25 μm, He, 60. C @ 4. min, 4. K/min, 240. C @ 2. min |
Capillary | DB-5 | 1193. | Adams and Nguyen, 2005 | 30. m/0.26 mm/0.25 μm, He, 3. K/min; Tstart: 60. C; Tend: 246. C |
Capillary | HP-5MS | 1195. | Asuming, Beauchamp, et al., 2005 | 30. m/0.25 mm/0.25 μm, He, 50. C @ 10. min, 3. K/min, 250. C @ 5. min |
Capillary | BP-5 | 1211. | Baranauskiene, Venskutonis, et al., 2005 | 50. m/0.32 mm/0.25 μm, He, 50. C @ 2. min, 5. K/min, 260. C @ 5. min |
Capillary | DB-5 | 1197. | Avato, Raffo, et al., 2004 | 30. m/0.25 mm/0.25 μm, H2, 4. K/min, 280. C @ 30. min; Tstart: 40. C |
Capillary | HP-5 | 1196. | Lopes, Strobl, et al., 2004 | 30. m/0.25 mm/0.25 μm, He, 3. K/min; Tstart: 60. C; Tend: 260. C |
Capillary | SE-30 | 1182. | Palá-Paúl, Velasco-Negueruela, et al., 2002 | 25. m/0.22 mm/0.25 μm, He, 4. K/min; Tstart: 70. C; Tend: 220. C |
Capillary | SE-54 | 1193. | Adams, 2000 | 30. m/0.26 mm/0.25 μm, He, 3. K/min; Tstart: 60. C; Tend: 246. C |
Capillary | SE-54 | 1193. | Adams, 2000, 2 | 30. m/0.26 mm/0.25 μm, 3. K/min; Tstart: 60. C; Tend: 246. C |
Capillary | DB-5 | 1193. | Adams, 2000, 3 | 30. m/0.26 mm/0.25 μm, He, 3. K/min; Tstart: 60. C; Tend: 246. C |
Capillary | DB-5 | 1193. | Adams, 1999 | 30. m/0.26 mm/0.25 μm, He, 3. K/min; Tstart: 60. C; Tend: 246. C |
Capillary | BP-1 | 1190. | Vera and Chane-Ming, 1999 | 50. m/0.25 mm/0.25 μm, 2. K/min; Tstart: 60. C; Tend: 260. C |
Capillary | BP-1 | 1196. | Vera and Chane-Ming, 1999 | 50. m/0.25 mm/0.25 μm, 2. K/min; Tstart: 60. C; Tend: 260. C |
Capillary | Methyl Silicone | 1185. | Adegoke, Rao, et al., 1998 | 30. m/0.32 mm/0.25 μm, He, 60. C @ 2. min, 2. K/min, 250. C @ 5. min |
Capillary | DB-5 | 1194. | Tellez, Estell, et al., 1997 | 30. m/0.25 mm/0.25 μm, He, 3. K/min; Tstart: 60. C; Tend: 240. C |
Capillary | SE-30 | 1182. | Jantan, Ahmad, et al., 1996 | N2, 60. C @ 10. min, 3. K/min, 180. C @ 1. min; Column length: 25. m; Column diameter: 0.2 mm |

Kovats' RI, non-polar column, custom temperature program

Column type | Active phase | I | Reference | Comment |
---|---|---|---|---|
Capillary | BP-1 | 1192. | Dwivedi, Khan, et al., 2004 | 25. m/0.25 mm/0.25 μm, N2; Program: 60C => 5C/min => 220C(5min) => 3C/min => 245C(5min) |

Kovats' RI, polar column, temperature ramp

Column type | Active phase | I | Reference | Comment |
---|---|---|---|---|
Capillary | DB-Wax | 1760. | Avato, Raffo, et al., 2004 | 30. m/0.25 mm/0.25 μm, H2, 40. C @ 2. min, 4. K/min, 260. C @ 15. min |
Capillary | Carbowax 20M | 1719. | Vera and Chane-Ming, 1999 | 50. m/0.32 mm/0.2 μm, 2. K/min; Tstart: 60. C; Tend: 260. C |
Capillary | Carbowax 20M | 1741. | Vera and Chane-Ming, 1999 | 50. m/0.32 mm/0.2 μm, 2. K/min; Tstart: 60. C; Tend: 260. C |

Kovats' RI, polar column, custom temperature program

Column type | Active phase | I | Reference | Comment |
---|---|---|---|---|
Capillary | Carbowax | 1749. | Okamoto, Ellison, et al., 1981 | Column length: 127. m; Column diameter: 0.75 mm; Program: not specified |

Van Den Dool and Kratz RI, non-polar column, temperature ramp

Column type | Active phase | I | Reference | Comment |
---|---|---|---|---|
Capillary | HP-5MS | 1195. | Benkaci-Ali, Baaliouamer, et al., 2007 | 30. m/0.25 mm/0.25 μm, He, 60. C @ 8. min, 2. K/min, 250. C @ 30. min |
Capillary | BP-1 | 1179. | Lesueur, de Rocca Serra, et al., 2007 | 50. m/0.22 mm/0.25 μm, He, 2. K/min, 220. C @ 20. min; Tstart: 60. C |
Capillary | CP Sil 5 CB | 1190. | Andrianoelisoa H.S., Menut C., et al., 2006 | 30. m/0.25 mm/0.25 μm, N2, 5. K/min; Tstart: 50. C; Tend: 200. C |
Capillary | BP-1 | 1180. | Gonny, Cavaleiro, et al., 2006 | 50. m/0.22 mm/0.25 μm, He, 2. K/min, 220. C @ 20. min; Tstart: 60. C |
Capillary | DB-1 | 1198. | bin Jantan, Yalvema, et al., 2005 | 25. m/0.25 mm/0.25 μm, 60. C @ 10. min, 3. K/min, 180. C @ 10. min |
Capillary | RTX-1 | 1179. | Paolini, Costa, et al., 2005 | 60. m/0.22 mm/0.25 μm, He, 2. K/min, 230. C @ 35. min; Tstart: 60. C |
Capillary | SPB-1 | 1178. | Cavaleiro, Salgueiro, et al., 2004 | 30. m/0.2 mm/0.2 μm, He, 3. K/min, 220. C @ 15. min; Tstart: 70. C |
Capillary | HP-5 | 1195. | Javidnia, Miri, et al., 2004 | 30. m/0.25 mm/0.25 μm, He, 3. K/min; Tstart: 60. C; Tend: 260. C |
Capillary | HP-5MS | 1211. | Karioti, Hadjipavlou-Litina, et al., 2004 | 30. m/0.25 mm/0.25 μm, He, 60. C @ 5. min, 4. K/min; Tend: 280. C |
Capillary | HP-5MS | 1196. | Salido, Valenzuela, et al., 2004 | 30. m/0.25 mm/0.25 μm, He, 3. K/min; Tstart: 50. C; Tend: 250. C |
Capillary | HP-5 | 1193. | Stashenko, Jaramillo, et al., 2004 | 50. m/0.2 mm/0.2 μm, He, 40. C @ 15. min, 3. K/min, 250. C @ 40. min |
Capillary | DB-5 | 1194. | bin Ahmad and bin Jantan, 2003 | 25. m/0.25 mm/0.25 μm, N2, 75. C @ 10. min, 3. K/min, 210. C @ 1. min |
Capillary | DB-5 | 1198. | Jantan, Ling, et al., 2003 | 30. m/0.25 mm/0.25 μm, He, 75. C @ 10. min, 3. K/min, 230. C @ 20. min |
Capillary | DB-5 | 1196. | bin Jantan, Yassin, et al., 2003 | 30. m/0.25 mm/0.25 μm, N2, 75. C @ 10. min, 3. K/min; Tend: 230. C |
Capillary | HP-5 | 1193. | Karioti, Skaltsa, et al., 2003 | 30. m/0.25 mm/0.25 μm, He, 60. C @ 5. min, 4. K/min; Tend: 280. C |
Capillary | SE-30 | 1182. | bin Jantan, Ayop, et al., 2002 | 25. m/0.25 mm/0.25 μm, N2, 60. C @ 10. min, 3. K/min, 180. C @ 10. min |
Capillary | CP Sil 5 CB | 1176. | Pino, Marbot, et al., 2002 | 25. m/0.25 mm/0.25 μm, N2, 60. C @ 6. min, 4. K/min; Tend: 280. C |
Capillary | HP-5MS | 1196. | Salido, Altarejos, et al., 2001 | 30. m/0.25 mm/0.25 μm, He, 3. K/min; Tstart: 50. C; Tend: 250. C |
Capillary | HP-5MS | 1191. | Skaltsa, Mavrommati, et al., 2001 | 30. m/0.25 mm/0.25 μm, He, 60. C @ 5. min, 4. K/min; Tend: 280. C |
Capillary | HP-5 | 1204. | Alonzo, Bosco, et al., 2000 | 30. m/0.20 mm/0.25 μm, He, 60. C @ 8. min, 4. K/min, 180. C @ 2. min |
Capillary | Mega 5MS | 1197. | Verzera, Trozzi, et al., 2000 | 30. m/0.25 mm/0.25 μm, He, 40. C @ 2. min, 3. K/min; Tend: 240. C |
Capillary | CP Sil 5 CB | 1186. | Weyerstahl, Marschall, et al., 1999 | He, 5. K/min; Column length: 25. m; Column diameter: 0.25 mm; Tstart: 60. C; Tend: 260. C |
Capillary | OV-1 | 1183. | Bicchi, Rubiolo, et al., 1998 | 25. m/0.25 mm/0.3 μm, 50. C @ 1. min, 3. K/min, 200. C @ 20. min |
Capillary | BP-1 | 1182. | Mariotti, Costa, et al., 1997 | 50. m/0.22 mm/0.25 μm, He, 2. K/min, 230. C @ 35. min; Tstart: 60. C |
Capillary | Methyl Silicone | 1208. | Píry, Príbela, et al., 1995 | 25. m/0.2 mm/0.3 μm, He, 2. K/min; Tstart: 40. C; Tend: 200. C |
Capillary | HP-101 | 1203. | Chung, Eiserich, et al., 1993 | N2, 3. K/min; Column length: 50. m; Column diameter: 0.25 mm; Tstart: 70. C; Tend: 200. C |
Capillary | DB-5 | 1215. | Le Quere and Latrasse, 1990 | 60. m/0.32 mm/1. μm, He, 3. K/min; Tstart: 40. C; Tend: 220. C |

Van Den Dool and Kratz RI, polar column, temperature ramp

Column type | Active phase | I | Reference | Comment |
---|---|---|---|---|
Capillary | RTX-Wax | 1742. | Paolini, Costa, et al., 2005 | 60. m/0.22 mm/0.25 μm, He, 2. K/min, 230. C @ 35. min; Tstart: 60. C |
Capillary | Carbowax 20M | 1750. | Píry, Príbela, et al., 1995 | 50. m/0.2 mm/0.2 μm, He, 30. C @ 2. min, 4. K/min, 170. C @ 20. min |
Capillary | HP-FFAP | 1698. | Chung, Eiserich, et al., 1993 | He, 3. K/min; Column length: 50. m; Column diameter: 0.25 mm; Tstart: 60. C; Tend: 210. C |
Capillary | Carbowax 20M | 1701. | Kawakami, Sachs, et al., 1990 | He, 60. C @ 4. min, 2. K/min; Column length: 50. m; Column diameter: 0.25 mm; Tend: 180. C |
Capillary | DB-Wax | 1747. | Le Quere and Latrasse, 1990 | 30. m/0.32 mm/0.5 μm, He, 3. K/min; Tstart: 40. C; Tend: 220. C |

Normal alkane RI, non-polar column, isothermal

Column type | Active phase | Temperature (C) | I | Reference | Comment |
---|---|---|---|---|---|
Capillary | DB-5 | 25. | 1193. | Hemmateenejad, Jawadnia, et al., 2007 |

Normal alkane RI, non-polar column, temperature ramp

Column type | Active phase | I | Reference | Comment |
---|---|---|---|---|
Capillary | DB-1-MS | 1178. | Takeoka, Hobbs, et al., 2010 | 60. m/0.25 mm/0.25 μm, Helium, 30. C @ 4. min, 2. K/min, 200. C @ 35. min |
Capillary | HP-5MS | 1203. | Zouari, Zouari, et al., 2010 | 30. m/0.25 mm/0.25 μm, Helium, 50. C @ 1. min, 7. K/min, 250. C @ 5. min |
Capillary | RTX-1 | 1181. | Museli, Pau, et al., 2009 | 60. m/0.22 mm/0.25 μm, Helium, 2. K/min, 230. C @ 30. min; Tstart: 60. C |
Capillary | RTX-1 | 1181. | Museli, Pau, et al., 2009 | 60. m/0.22 mm/0.25 μm, Helium, 2. K/min, 230. C @ 30. min; Tstart: 60. C |
Capillary | HP-5 MS | 1193. | Adams, Beauchamp, et al., 2007 | 30. m/0.25 mm/0.25 μm, Helium, 50. C @ 10. min, 3. K/min, 230. C @ 10. min |
Capillary | DB-5 | 1195. | Bos, Woerdenbag, et al., 2007 | 30. m/0.26 mm/0.25 μm, He, 3. K/min; Tstart: 60. C; Tend: 240. C |
Capillary | HP-5 | 1193. | Cheraif, Ben Jannet, et al., 2007 | 30. m/0.25 mm/0.25 μm, N2, 50. C @ 1. min, 5. K/min, 240. C @ 4. min |
Capillary | DB-5 | 1195. | Elfami, Bos, et al., 2007 | 30. m/0.26 mm/0.25 μm, Helium, 3. K/min; Tstart: 60. C; Tend: 290. C |
Capillary | DB-5 | 1194. | Ghasemi, Yamini, et al., 2007 | 30. m/0.25 mm/0.25 μm, He, 60. C @ 3. min, 30. K/min; Tend: 210. C |
Capillary | ZB-5 | 1193. | Mohottalage, Tabacchi, et al., 2007 | 30. m/0.25 mm/0.25 μm, 60. C @ 5. min, 4. K/min, 220. C @ 20. min |
Capillary | HP-5MS | 1167. | Tzakou, Bazos, et al., 2007 | 30. m/0.25 mm/0.25 μm, He, 3. K/min; Tstart: 60. C; Tend: 280. C |
Capillary | AT-5 | 1196. | Borges, Rojas, et al., 2006 | 60. m/0.25 mm/0.25 μm, He, 4. K/min, 200. C @ 20. min; Tstart: 60. C |
Capillary | SPB-1 | 1177. | Cavaleiro, Pinto, et al., 2006 | 30. m/0.20 mm/0.20 μm, Helium, 3. K/min, 220. C @ 15. min; Tstart: 70. C |
Capillary | HP-5 | 1196. | Coronel, Cerda-Garcia-Rojas, et al., 2006 | 30. m/0.32 mm/0.25 μm, He, 3. K/min; Tstart: 60. C; Tend: 246. C |
Capillary | DB-5 | 1195. | Elfami, Komar, et al., 2006 | 30. m/0.26 mm/0.25 μm, Helium, 3. K/min; Tstart: 60. C; Tend: 290. C |
Capillary | CP Sil 5 CB | 1186. | Lis and Milczarek, 2006 | 30. m/0.32 mm/0.25 μm, N2, 4. K/min; Tstart: 50. C; Tend: 300. C |
Capillary | DB-5 | 1193. | Pino, Marbot, et al., 2006 | 30. m/0.25 mm/0.25 μm, Hydrogen, 70. C @ 4. min, 4. K/min; Tend: 280. C |
Capillary | DB-1 | 1182. | Sonboli, Mirjalili, et al., 2006 | 60. m/0.25 mm/0.25 μm, Helium, 5. K/min, 250. C @ 10. min; Tstart: 60. C |
Capillary | DB-5 | 1194. | Khayyat and Karimi, 2005 | He, 3. K/min; Column length: 30. m; Column diameter: 0.32 mm; Tstart: 60. C; Tend: 240. C |
Capillary | DB-5 | 1196. | Skoula and Grayer, 2005 | 30. m/0.25 mm/0.25 μm, He, 3. K/min, 230. C @ 20. min; Tstart: 60. C |
Capillary | HP-5MS | 1169. | Tzakou, Bazos, et al., 2005 | 30. m/0.25 mm/0.25 μm, He, 3. K/min; Tstart: 60. C; Tend: 280. C |
Capillary | DB-5 | 1189. | Agnihotri, Thappa, et al., 2004 | 30. m/0.25 mm/0.25 μm, He, 90. C @ 2. min, 7. K/min, 220. C @ 5. min |
Capillary | DB-5 | 1200. | Edris and Farrag, 2003 | He, 3. K/min; Column length: 60. m; Column diameter: 0.32 mm; Tstart: 50. C; Tend: 220. C |
Capillary | DB-5 | 1215. | Edris, Shalaby, et al., 2003 | He, 3. K/min; Column length: 60. m; Column diameter: 0.32 mm; Tstart: 50. C; Tend: 200. C |
Capillary | DB-5 | 1198. | Masotti, Juteau, et al., 2003 | 50. m/0.2 mm/0.25 μm, He, 50. C @ 2. min, 3. K/min; Tend: 220. C |
Capillary | DB-5 | 1193. | Pino, Marbot, et al., 2003 | 30. m/0.25 mm/0.25 μm, H2, 60. C @ 10. min, 4. K/min, 280. C @ 40. min |
Capillary | HP-5 | 1178. | Pitarokili, Tzakou, et al., 2003 | 30. m/0.25 mm/0.25 μm, He, 3. K/min; Tstart: 60. C; Tend: 280. C |
Capillary | DB-1 | 1183. | Shahmir, Ahmadi, et al., 2003 | 60. m/0.25 mm/0.25 μm, He, 4. K/min; Tstart: 50. C; Tend: 280. C |
Capillary | DB-5 | 1193. | Bos, Koulman, et al., 2002 | 30. m/0.249 mm/0.25 μm, He, 3. K/min, 300. C @ 5. min; Tstart: 60. C |
Capillary | HP-1 | 1177. | Cavaleiro, Salgueiro, et al., 2002 | 30. m/0.25 mm/0.25 μm, He, 3. K/min, 220. C @ 15. min; Tstart: 70. C |
Capillary | HP-5 | 1199. | Novak, Langbehn, et al., 2002 | 30. m/0.25 mm/0.25 μm, 3. K/min; Tstart: 60. C; Tend: 240. C |
Capillary | RTX-1 | 1185. | Kalemba, 1999 | 30. m/0.25 mm/0.25 μm, N2, 4. K/min; Tstart: 60. C; Tend: 300. C |
Capillary | DB-1 | 1193. | Koulman, 1999 | 25. m/0.25 mm/0.25 μm, He, 4. K/min; Tstart: 50. C; Tend: 290. C |
Capillary | DB-5 | 1194. | Maia, Zohhbi, et al., 1998 | 30. m/0.25 mm/0.25 μm, He, 3. K/min; Tstart: 60. C; Tend: 240. C |
Capillary | SE-54 | 1200. | Kollmannsberger, Nitz, et al., 1992 | 30. m/0.25 mm/0.25 μm, Hydrogen, 60. C @ 5. min, 2. K/min, 250. C @ 2. min |
Capillary | BP-1 | 1195. | Brophy, Davies, et al., 1989 | H2, 40. C @ 1. min, 10. K/min; Column length: 50. m; Column diameter: 0.30 mm; Tend: 250. C |

Normal alkane RI, non-polar column, custom temperature program

Column type | Active phase | I | Reference | Comment |
---|---|---|---|---|
Capillary | HP-5 MS | 1196. | Bai, Liu, et al., 2011 | 30. m/0.25 mm/0.25 μm, Helium; Program: 60 0C (1 min) 10 0C/min -> 180 0C (1 min) 20 0C/min -> 280 0C (15 min) |
Capillary | 5 % Phenyl polydimethyl siloxane | 1199. | Chaverri, Diaz, et al., 2011 | Program: not specified |
Capillary | DB-1-MS | 1175. | Takeoka, Hobbs, et al., 2010 | 60. m/0.25 mm/0.25 μm, Helium; Program: not specified |
Capillary | HP-5MS | 1203. | Ning, Zheng, et al., 2008 | 30. m/0.25 mm/0.25 μm, He; Program: 40 0C (2 min) 3 0C/min -> 180 0C (2 min) 15 0C -> 280 0C |
Capillary | RTX-5 | 1201. | Zachariah, Leela, et al., 2008 | 30. m/0.25 mm/0.25 μm, Helium; Program: 60 0C (5 min) 5 0C/min -> 110 0C 3 0C/min -> 220 0C (5 min) |
Capillary | RTX-5 | 1196. | Zachariah, Leela, et al., 2008 | 30. m/0.25 mm/0.25 μm, Helium; Program: not specified |
Capillary | HP-5MS | 1195. | Cole, Haber, et al., 2007 | 30. m/0.25 mm/0.25 μm, He; Program: 40C(10min) => 3C/min => 200C => 2C/min => 220C |
Capillary | DB-5 | 1196. | Nivinsliene, Butkiene, et al., 2007 | 50. m/0.32 mm/0.25 μm, Helium; Program: 60 0C (1 min) 5 0C/min -> 160 0C 10 0C/min -> 250 0C |
Capillary | CP Sil 8 CB | 1196. | Radudienë, Judpintienë, et al., 2005 | 50. m/0.32 mm/0.25 μm, He; Program: 60C(2min) => 5C/min => 160C(1min) => 10C/min => 250C (3min) |
Capillary | 1178. | El-Shazily, Hafez, et al., 2004 | Program: not specified | |
Capillary | CP Sil 8 CB | 1193. | Judpentienë and Mockutë, 2004 | 50. m/0.32 mm/0.25 μm, He; Program: 60C(2min) => 5C/min => 160C(1min) => 10C/min => 250C (5min) |
Capillary | HP-5 | 1183. | Senatore, Apostolides Arnold, et al., 2004 | 30. m/0.25 mm/0.25 μm; Program: 40C(5min) => 2C/min => 250C(15min) => 10C/min => 270C |
Capillary | HP-5MS | 1198. | Singh, Marimuthu, et al., 2004 | 30. m/0.25 mm/0.25 μm; Program: 60C(1min) => 1.5C/min => 185C(1min) => 9C/min => 275C(2min) |
Capillary | HP-5 | 1196. | Tepe, Donmez, et al., 2004 | 30. m/0.25 mm/0.25 μm, He; Program: 50C (3min) => 3C/min => 150C (10min) => 10C/min => 250C |
Capillary | SE-30 | 1187. | Vinogradov, 2004 | Program: not specified |
Capillary | CP Sil 5 CB | 1184. | Weyerstahl, Marschall, et al., 1999, 2 | Column length: 25. m; Column diameter: 0.39 mm; Program: not specified |
Capillary | Polydimethyl siloxanes | 1185. | Zenkevich, 1997 | Program: not specified |

Normal alkane RI, polar column, temperature ramp

Column type | Active phase | I | Reference | Comment |
---|---|---|---|---|
Capillary | Stabilwax | 1738. | Jirovetz, Buchbauer, et al., 2005 | 30. m/0.32 mm/0.5 μm, H2, 40. C @ 5. min, 6. K/min, 280. C @ 5. min |
Capillary | DB-Wax | 1770. | Agnihotri, Thappa, et al., 2004 | 30. m/0.25 mm/0.25 μm, He, 90. C @ 2. min, 7. K/min, 220. C @ 5. min |
Capillary | Innowax FSC | 1758. | Lourens, Reddy, et al., 2004 | Helium, 60. C @ 10. min, 4. K/min; Column length: 60. m; Column diameter: 0.25 mm; Tend: 220. C |
Capillary | DB-Wax | 1744. | Christoph, 2001 | 60. m/0.25 mm/0.25 μm, He, 3. K/min; Tstart: 45. C; Tend: 240. C |
Capillary | NB-351 | 1747. | Onocha, Ekundayo, et al., 1999 | 25. m/0.3 mm/0.5 μm, H2, 70. C @ 2. min, 5. K/min; Tend: 250. C |
Capillary | HP-Innowax FSC | 1758. | Baser, Kirimer, et al., 1997 | He, 60. C @ 10. min, 4. K/min, 240. C @ 10. min; Column length: 60. m; Column diameter: 0.25 mm |
Capillary | Carbowax 20M | 1741. | Kollmannsberger, Nitz, et al., 1992 | 45. m/0.32 mm/1.0 μm, Hydrogen, 60. C @ 5. min, 2. K/min; Tend: 200. C |
Capillary | FFAP | 1771. | Brophy, Davies, et al., 1989 | 50. C @ 1. min, 10. K/min; Column length: 50. m; Tend: 180. C |
Capillary | Carbowax 20M | 1741. | Nykanen, 1986 | 40. C @ 5. min, 2. K/min; Column length: 25. m; Column diameter: 0.30 mm; Tend: 220. C |

Normal alkane RI, polar column, custom temperature program

Column type | Active phase | I | Reference | Comment |
---|---|---|---|---|
Capillary | Innowax FSC | 1758. | Polatoglu, Demirci, et al., 2010 | 60. m/0.25 mm/0.25 μm, Helium; Program: 60 0C (10 min) 4 0C/min -> 220 0C (10 min) 1 0C/min -> 240 0C |
Capillary | Innowax FSC | 1758. | Baser, Demirci, et al., 2009 | 60. m/0.25 mm/0.25 μm, Helium; Program: 60 0C (10 min) 4 0C/min -> 220 0C (10 min) 1 0C/min -> 240 0C |
Capillary | HP Innowax FSP | 1758. | Wedge, Klun, et al., 2009 | 60. m/0.25 mm/0.25 μm, Helium; Program: 60 0C (10 min) 4 0C/min -> 220 0C (10 min) 1 0C/min -> 240 0C (20 min) |
Capillary | HP Innowax FSP | 1758. | Tabanca N., Demirci B., et al., 2007 | 60. m/0.25 mm/0.25 μm, N2; Program: 60C(10min) => 4C/min => 220C(10min) => 1C/min => 240C |
Capillary | HP-Innowax FSC | 1758. | Demirci B., Baser K.H.C., et al., 2006 | 60. m/0.25 mm/0.25 μm, N2; Program: 60C(10min) => 4C/min => 220C(10min) => 1C/min => 240C |
Capillary | Innowax FSC | 1758. | Iscan, Kirimer, et al., 2006 | 60. m/0.25 mm/0.25 μm, N2; Program: 60C(10min) => 4C/min => 220C(10min) => 1C/min => 240C |
Capillary | HP-Innowax FSC | 1758. | Kürkçüoglu, Hüsnü Can Baser, et al., 2006 | 60. m/0.25 mm/0.25 μm, He; Program: 60C(10min) => 4C/min => 220C (10min) => 1C/min => 240C |
Capillary | HP-Innowax FSC | 1758. | Suleimenov Y.M., Atazhanova G.A., et al., 2006 | 60. m/0.25 mm/0.25 μm, He; Program: 60(10min) => 4C/min => 220C(10min) => 1C/min => 240C |
Capillary | HP-Innowax | 1758. | Demirci, Demirci, et al., 2005 | 60. m/0.25 mm/0.25 μm, N2; Program: 60C(10min) => 4C/min => 220C (10min) => 1C/min => 240C |
Capillary | HP-Innowax FSC | 1758. | Viljoen, Subramoney, et al., 2005 | 60. m/0.25 mm/0.25 μm, He; Program: 60C(10min) => 4C/min => 220C(10min) => 1C/min => 240C |
Capillary | HP-Innowax FSC | 1758. | Demirci, Paper, et al., 2004 | 60. m/0.25 mm/0.25 μm, He; Program: 60C(10min) => 4C/min => 220C(10min) => 1C/min => 240C |
Capillary | HP-Innowax FSC | 1758. | Kivcak, Akay, et al., 2004 | 60. m/0.25 mm/0.25 μm, He; Program: 60C(10min) => 4C/min => 220C(10min) => 1C/min => 240C |
Capillary | HP-Innowax | 1757. | Senatore, Apostolides Arnold, et al., 2004 | 50. m/0.2 mm/0.2 μm; Program: not specified |
Capillary | HP-Innowax FSC | 1758. | Demirci, Baser, et al., 2003 | 60. m/0.25 mm/0.25 μm, He; Program: 60C (10min) => 4C/min => 220C (10min) => 1C/min => 240C |
Capillary | Carbowax | 1743. | Edris, Shalaby, et al., 2003 | Program: not specified |
Capillary | HP-Innowax FSC | 1758. | Kaya, Demirci, et al., 2003 | 60. m/0.25 mm/0.25 μm, N2; Program: 60C(10min) => 4C/min => 220C(10min) => 1C/min => 240C |
Capillary | HP-Innowax FSC | 1758. | Kürkcüoglu, Demirci, et al., 2003 | 60. m/0.25 mm/0.25 μm, He; Program: 60C(10min) => 4C/min => 220C(10min) => 1C/min => 240C(40min) |
Capillary | HP-Innowax | 1758. | Viljoen, van Vuuren, et al., 2003 | 60. m/0.25 mm/0.25 μm; Program: 60C(10min) => 4C/min => 220C(10min) => 1C/min => 240C |
Capillary | HP-Innowax | 1758. | Baser, Demirci, et al., 2002 | 60. m/0.25 mm/0.25 μm, He; Program: 60 0C (10 min) 4 K/min -> 220 0C (10 min) 1 K/min -> 240 0C |
Capillary | Innowax FSC | 1758. | Baser, Demirei, et al., 2002 | 60. m/0.25 mm/0.25 μm, He; Program: 60C(10min) => 4C/min => 220C(10min) => 1C/min => 240C |
Capillary | Innowax | 1758. | Baser, Nuriddinov, et al., 2002 | 60. m/0.25 mm/0.25 μm, He; Program: 60C(10min) => 4C/min => 220C(10min) => 1C/min => 240C |
Capillary | HP-Innowax FSC | 1758. | Hüsnü Can Baser, Demirci, et al., 2002 | 60. m/0.25 mm/0.25 μm, N2; Program: 60C(10min) => 4C/min => 220C(10min) => 1C/min => 240C |
Capillary | Innowax FSC | 1758. | Tunalier, Kirimer, et al., 2002 | 60. m/0.25 mm/0.25 μm; Program: 60C(10min) => 4C/min => 220C(10min) => 1C/min => 240C |
Capillary | HP-Innowax | 1758. | Baser, Demirci, et al., 2001 | 60. m/0.25 mm/0.25 μm, He; Program: 60 0C (10 min) 10 K/min -> 220 0C (10 min) 1K/min -> 240 0C |
Capillary | HP-Innowax | 1758. | Gören, Demirci, et al., 2001 | 60. m/0.25 mm/0.25 μm, He; Program: 60 0C (10 min) 4 K/min -> 220 0C (10 min) 1 K/min -> 240 0C |
Capillary | Innowax | 1758. | Özcan, Akgül, et al., 2001 | 60. m/0.25 mm/0.25 μm, He; Program: 60C(10min) => 4C/min => 200C(10min) => 1C/min => 240C |
Capillary | Innowax | 1758. | Baser, Özek, et al., 2000 | 60. m/0.25 mm/0.25 μm, He; Program: 60 0C (10 min) 4 K/min -> 220 0C (10 min) 1 K/min -> 240 0C |
Capillary | Innowax | 1758. | Baser, Tabanca, et al., 2000 | 60. m/0.25 mm/0.25 μm, He; Program: 60 0C (10 min) 4 K/min -> 220 0C (10 min) 1 K/min -> 240 0C |

References

Adams, González Elizondo, et al., 2006
Adams, R.P.; González Elizondo, M.S.; González Elizondo, M.; Slinkman, E.,
DNA fingerprinting and terpenoid analysis of Juniperus blancoi var. huehuentensis (Cupressaceae), a new subalpine variety from Durango, Mexico,
Biochem. Syst. Ecol., 2006, 34, 3, 205-211, https://doi.org/10.1016/j.bse.2005.11.004
. [all data]
Walde, Jyothirmayi, et al., 2006
Walde, S.G.; Jyothirmayi, T.; Prabhakara Rao, P.G.; Srinivas, P.,
Flavour volatiles of flowers and stalks of Murraya koenigii L.,
Flavour Fragr. J., 2006, 21, 4, 581-584, https://doi.org/10.1002/ffj.1737
. [all data]
Adams and Nguyen, 2005
Adams, R.P.; Nguyen, S.,
Infra-specific variation in Juniperus deppeana and F. Sperryi in the Davis Mountains of Texas: variation in leaf essential oils and random amplified polymorphic DNAS (RAPDS),
Phytologia, 2005, 87, 2, 96-108. [all data]
Asuming, Beauchamp, et al., 2005
Asuming, W.A.; Beauchamp, P.S.; Descalzo, J.T.; Dev, B.C.; Dev, V.; Frost, S.; Ma, C.W.,
Essential oil composition of four Lomatium Raf. species and their chemotaxonomy,
Biochem. Syst. Ecol., 2005, 33, 1, 17-26, https://doi.org/10.1016/j.bse.2004.06.005
. [all data]
Baranauskiene, Venskutonis, et al., 2005
Baranauskiene, R.; Venskutonis, R.P.; Demyttenaere, J.C.R.,
Sensory and instrumental evaluation of sweet marjoram (Origanum majorana L.) aroma,
Flavour Fragr. J., 2005, 20, 5, 492-500, https://doi.org/10.1002/ffj.1478
. [all data]
Avato, Raffo, et al., 2004
Avato, P.; Raffo, F.; Aldouri, N.A.; Vartanian, S.T.,
Essential oils of varthemia iphionoides from Jordan,
Flavour Fragr. J., 2004, 19, 6, 559-561, https://doi.org/10.1002/ffj.1351
. [all data]
Lopes, Strobl, et al., 2004
Lopes, D.; Strobl, H.; Kolodziejczyk, P.,
14-Methylpentadecano-15-lactone (Muscolide): a new macrocyclic lactone from the oil of Angelica archangelica L.,
Chemistry and Biodiversity, 2004, 1, 12, 1880-1887, https://doi.org/10.1002/cbdv.200490144
. [all data]
Palá-Paúl, Velasco-Negueruela, et al., 2002
Palá-Paúl, J.; Velasco-Negueruela, A.; Pérez-Alonso, M.J.; Sanz, J.,
Essential oil composition of the aerial parts of Cachrys sicula L.,
Flavour Fragr. J., 2002, 17, 1, 64-68, https://doi.org/10.1002/ffj.1042
. [all data]
Adams, 2000
Adams, R.P.,
Systematics of smooth leaf margin Juniperus of the western hemisphere based on leaf essential oils and RAPD DNA fingerprinting,
Biochem. Syst. Ecol., 2000, 28, 2, 149-162, https://doi.org/10.1016/S0305-1978(99)00047-2
. [all data]
Adams, 2000, 2
Adams, R.P.,
Systematics of the one seeded Juniperus of the eastern hemisphere based on leaf essential oils and random amplified polymorphic DNAs (RAPDs),
Biochem. Syst. Ecol., 2000, 28, 6, 529-543, https://doi.org/10.1016/S0305-1978(99)00096-4
. [all data]
Adams, 2000, 3
Adams, R.P.,
The serrate leaf margined Juniperus (Section Sabina) of the western hemisphere: systematics and evolution based on leaf essential oils and Random Amplified Polymorphic DNAs (RAPDs),
Biochem. Syst. Ecol., 2000, 28, 10, 975-989, https://doi.org/10.1016/S0305-1978(00)00022-3
. [all data]
Adams, 1999
Adams, R.P.,
Systematics of multi-seeded eastern hemisphere Juniperus based on leaf essential oils and RAPD DNA fingerprinting,
Biochem. Syst. Ecol., 1999, 27, 7, 709-725, https://doi.org/10.1016/S0305-1978(99)00016-2
. [all data]
Vera and Chane-Ming, 1999
Vera, R.R.; Chane-Ming, J.,
Chemical composition of the essential oil of marjoram (Origanum majorana L.) from Reunion Island,
Food Chem., 1999, 66, 2, 143-145, https://doi.org/10.1016/S0308-8146(98)00018-1
. [all data]
Adegoke, Rao, et al., 1998
Adegoke, G.O.; Rao, L.J.M.; Shankaracharya, N.B.,
A comparison of the essential oils of Aframomum daniellii (Hook. f.) K. Schum. and Amomum subulatum Roxb,
Flavour Fragr. J., 1998, 13, 5, 349-352, https://doi.org/10.1002/(SICI)1099-1026(1998090)13:5<349::AID-FFJ758>3.0.CO;2-O
. [all data]
Tellez, Estell, et al., 1997
Tellez, M.R.; Estell, R.E.; Fredrickson, E.L.; Havstad, K.M.,
Essential oil of Dyssodia acerosa DC.,
J. Agric. Food Chem., 1997, 45, 8, 3276-3278, https://doi.org/10.1021/jf9701502
. [all data]
Jantan, Ahmad, et al., 1996
Jantan, I.; Ahmad, A.S.; Ahmad, A.R.; Ali, N.A.M.; Ayop, N.,
Chemical composition of some citrus oils from Malaysia,
J. Essent. Oil Res., 1996, 8, 6, 627-632, https://doi.org/10.1080/10412905.1996.9701030
. [all data]
Dwivedi, Khan, et al., 2004
Dwivedi, S.; Khan, M.; Srivastava, S.K.; Syamasunnder, K.V.; Srivastava, A.,
Essential oil composition of different accessions of Mentha × piperita L. grown on the northern plains of India,
Flavour Fragr. J., 2004, 19, 5, 437-440, https://doi.org/10.1002/ffj.1333
. [all data]
Okamoto, Ellison, et al., 1981
Okamoto, R.A.; Ellison, B.O.; Kepner, R.E.,
Volatile terpenes in Sequoia sempervirens foliage. Changes in composition during maturation,
J. Agric. Food Chem., 1981, 29, 2, 324-326, https://doi.org/10.1021/jf00104a026
. [all data]
Benkaci-Ali, Baaliouamer, et al., 2007
Benkaci-Ali, F.; Baaliouamer, A.; Meklati, B.Y.; Chemat, F.,
Chemical composition of seed essential oils from Algerian Nigella sativa extracted by microwave and hydrodistillation,
Flavour Fragr. J., 2007, 22, 2, 148-153, https://doi.org/10.1002/ffj.1773
. [all data]
Lesueur, de Rocca Serra, et al., 2007
Lesueur, D.; de Rocca Serra, D.; Bighelli, A.; Hoi, T.M.; Ban, N.K.; Thai, T.H.; Casanova, J.,
Chemical composition and antibacterial activity of the essential oil of Michelia foveolata Merryll ex Dandy from Vietnam,
Flavour Fragr. J., 2007, 22, 4, 317-321, https://doi.org/10.1002/ffj.1799
. [all data]
Andrianoelisoa H.S., Menut C., et al., 2006
Andrianoelisoa H.S.; Menut C.; de Chatelperron P.C.; Saracco J.; Ramanoelina P.; Danthu P.,
Intraspecific chemical variability and highlighting of chemotypes of leaf essential oils from Ravensara aromatica Sonnerat a tree endemic to Madagascar,
Flavour Fragr. J., 2006, 21, 5, 833-838, https://doi.org/10.1002/ffj.1735
. [all data]
Gonny, Cavaleiro, et al., 2006
Gonny, M.; Cavaleiro, C.; Salgueiro, L.; Casanova, J.,
Analysis of Juniperus communis subsp. alpina needle, berry, wood and root oils by combination of GC, GC/MS and 13C-NMR,
Flavour Fragr. J., 2006, 21, 1, 99-106, https://doi.org/10.1002/ffj.1527
. [all data]
bin Jantan, Yalvema, et al., 2005
bin Jantan, I.; Yalvema, M.F.; Ahmad, N.W.; Jamal, J.A.,
Insecticidal activities of the leaf oils of eight Cinnamomum species against Aedes aegypti and Aedes albopictus,
Pharm. Biol., 2005, 43, 6, 526-532, https://doi.org/10.1080/13880200500220771
. [all data]
Paolini, Costa, et al., 2005
Paolini, J.; Costa, J.; Bernardini, A.,
Analysis of the essential oil from aerial parts of Eupatorium cannabinum subsp. corsicum (L.) by gas chromatography with electron impact and chemical ionization mass spectrometry,
J. Chromatogr. A, 2005, 1076, 1-2, 170-178, https://doi.org/10.1016/j.chroma.2005.03.131
. [all data]
Cavaleiro, Salgueiro, et al., 2004
Cavaleiro, C.; Salgueiro, L.R.; Miguel, M.G.; da Cunha, A.P.,
Analysis by gas chromatography?mass spectrometry of the volatile components of Teucrium lusitanicum and Teucrium algarbiensis,
J. Chromatogr. A, 2004, 1033, 1, 187-190, https://doi.org/10.1016/j.chroma.2004.01.005
. [all data]
Javidnia, Miri, et al., 2004
Javidnia, K.; Miri, R.; Jafari, A.; Rezai, H.,
Analysis of the volatile constituents of Nepeta macrosiphon Boiss. grown in Iran,
Flavour Fragr. J., 2004, 19, 2, 156-158, https://doi.org/10.1002/ffj.1287
. [all data]
Karioti, Hadjipavlou-Litina, et al., 2004
Karioti, A.; Hadjipavlou-Litina, D.; Mensah, M.L.K.; Fleischer, T.C.; Skaltsa, H.,
Composition and antioxidant activity of the essential oils of Xylopia aethiopica (Dun) A. Rich. (Annonaceae) leaves, stem bark, root bark, and fresh and dried fruits, growing in Ghana,
J. Agric. Food Chem., 2004, 52, 26, 8094-8098, https://doi.org/10.1021/jf040150j
. [all data]
Salido, Valenzuela, et al., 2004
Salido, S.; Valenzuela, L.R.; Altarejos, J.; Nogueras, M.; Sánchez, A.; Cano, E.,
Composition and infraspecific variability of Artemisia herba-alba from southern Spain,
Biochem. Syst. Ecol., 2004, 32, 3, 265-277, https://doi.org/10.1016/j.bse.2003.09.002
. [all data]
Stashenko, Jaramillo, et al., 2004
Stashenko, E.E.; Jaramillo, B.E.; Martínez, J.R.,
Analysis of volatile secondary metabolites from Colombian Xylopia aromatica (Lamarck) by different extraction and headspace methods and gas chromatography,
J. Chromatogr. A, 2004, 1025, 1, 105-113, https://doi.org/10.1016/j.chroma.2003.10.059
. [all data]
bin Ahmad and bin Jantan, 2003
bin Ahmad, F.; bin Jantan, I.,
Chemical constituents of the essential oils of Goniothalamus uvariodes King,
Flavour Fragr. J., 2003, 18, 2, 128-130, https://doi.org/10.1002/ffj.1142
. [all data]
Jantan, Ling, et al., 2003
Jantan, I.; Ling, Y.E.; Romli, S.; Ayop, N.; Ahmad, A.S.,
A comparative study of the constituents of the essential oils of three Cinnamomum species from Malaysia,
J. Essent. Oil Res., 2003, 15, 6, 387-391, https://doi.org/10.1080/10412905.2003.9698618
. [all data]
bin Jantan, Yassin, et al., 2003
bin Jantan, I.; Yassin, M.S.M.; Chin, C.B.; Chen, L.L.; Sim. N.L.,
Antifungal activity of the essential oils of nine Zingiberaceae species,
Pharm. Biol., 2003, 41, 5, 392-397, https://doi.org/10.1076/phbi.41.5.392.15941
. [all data]
Karioti, Skaltsa, et al., 2003
Karioti, A.; Skaltsa, H.; Demetzos, C.; Perdetzoglou, D.; Economakis, C.D.; Salem, A.B.,
Effect of nitrogen concentration of the nutrient solution on the volatile constituents of leaves of Salvia fruticosa Mill. in solution culture,
J. Agric. Food Chem., 2003, 51, 22, 6505-6508, https://doi.org/10.1021/jf030308k
. [all data]
bin Jantan, Ayop, et al., 2002
bin Jantan, I.; Ayop, N.; Hiong, A.B.; Ahmad, A.S.,
Chemical composition of the essential oils of Cinnamomum cordatum Kosterm,
Flavour Fragr. J., 2002, 17, 3, 212-214, https://doi.org/10.1002/ffj.1075
. [all data]
Pino, Marbot, et al., 2002
Pino, J.A.; Marbot, R.; Quert, R.; García, H.,
Study of essential oils of Eucalyptus resinifera Smith, E. tereticornis Smith and Corymbia maculata (Hook.) K.D. Hill L.A.S. Johnson, grown in Cuba,
Flavour Fragr. J., 2002, 17, 1, 1-4, https://doi.org/10.1002/ffj.1026
. [all data]
Salido, Altarejos, et al., 2001
Salido, S.; Altarejos, J.; Nogueras, M.; Sánchez, A.,
Chemical composition of the essential oil of Artemisia herba-alba Asso ssp. valentina (Lam.) Marcl.,
J. Essent. Oil Res., 2001, 13, 4, 221-224, https://doi.org/10.1080/10412905.2001.9699675
. [all data]
Skaltsa, Mavrommati, et al., 2001
Skaltsa, H.D.; Mavrommati, A.; Constantinidis, T.,
A chemotaxonomic investigation of volatile constituents in Stachys subsect. Swainsonianeae (Labiatae),
Phytochemistry, 2001, 57, 2, 235-244, https://doi.org/10.1016/S0031-9422(01)00003-6
. [all data]
Alonzo, Bosco, et al., 2000
Alonzo, G.; Bosco, S.F.D.; Palazzolo, E.; Saiano, F.; Tusa, N.,
Citrus somatic hybrid leaf essential oil,
Flavour Fragr. J., 2000, 15, 4, 258-262, https://doi.org/10.1002/1099-1026(200007/08)15:4<258::AID-FFJ906>3.0.CO;2-F
. [all data]
Verzera, Trozzi, et al., 2000
Verzera, A.; Trozzi, A.; Cotroneo, A.; Lorenzo, D.; Dellacassa, E.,
Uruguayan essential oil. 12. Composition of Nova and Satsuma mandarin oils,
J. Agric. Food Chem., 2000, 48, 7, 2903-2909, https://doi.org/10.1021/jf990734z
. [all data]
Weyerstahl, Marschall, et al., 1999
Weyerstahl, P.; Marschall, H.; Wahlburg, H.-C.; Christiansen, C.; Rustaiyan, A.; Mirdjalili, F.,
Constituents of the essential oil of Pulicaria gnaphalodes (Vent.) Boiss. from Iran,
Flavour Fragr. J., 1999, 14, 2, 121-130, https://doi.org/10.1002/(SICI)1099-1026(199903/04)14:2<121::AID-FFJ790>3.0.CO;2-K
. [all data]
Bicchi, Rubiolo, et al., 1998
Bicchi, C.; Rubiolo, P.; Marschall, H.; Weyerstahl, P.; Laurent, R.,
Constituents of Artemisia roxburghiana Besser essential oil,
Flavour Fragr. J., 1998, 13, 1, 40-46, https://doi.org/10.1002/(SICI)1099-1026(199801/02)13:1<40::AID-FFJ688>3.0.CO;2-Z
. [all data]
Mariotti, Costa, et al., 1997
Mariotti, J.P.; Costa, J.; Bianchini, A.; Bernardini, A.F.; Casanova, J.,
Composition and variability of the essential oil of Stachys glutinosa L. from Corsica (France),
Flavour Fragr. J., 1997, 12, 3, 205-209, https://doi.org/10.1002/(SICI)1099-1026(199705)12:3<205::AID-FFJ636>3.0.CO;2-I
. [all data]
Píry, Príbela, et al., 1995
Píry, J.; Príbela, A.; Durcanská, J.; Farkas, P.,
Fractionation of volatiles from blackcurrant (Ribes nigrum L.) by different extractive methods,
Food Chem., 1995, 54, 1, 73-77, https://doi.org/10.1016/0308-8146(95)92665-7
. [all data]
Chung, Eiserich, et al., 1993
Chung, T.Y.; Eiserich, J.P.; Shibamoto, T.,
Volatile compounds isolated from edible Korean chamchwi (Aster scaber Thunb),
J. Agric. Food Chem., 1993, 41, 10, 1693-1697, https://doi.org/10.1021/jf00034a033
. [all data]
Le Quere and Latrasse, 1990
Le Quere, J.-L.; Latrasse, A.,
Composition of the Essential Oils of Blackcurrant Buds (Ribes nigrum L.),
J. Agric. Food Chem., 1990, 38, 1, 3-10, https://doi.org/10.1021/jf00091a001
. [all data]
Kawakami, Sachs, et al., 1990
Kawakami, M.; Sachs, R.M.; Shibamoto, T.,
Volatile constituents of essential oils obtained from newly developed tea tree (Melaleuca alternifolia) clones,
J. Agric. Food Chem., 1990, 38, 8, 1657-1661, https://doi.org/10.1021/jf00098a007
. [all data]
Hemmateenejad, Jawadnia, et al., 2007
Hemmateenejad, B.; Jawadnia, K.; Elyasi, M.,
Quantitative structure - retention relationship for the Kovats retention indices of a large set of terpenes: a comdined data splitting-feature selection strategy,
Anal. Chim. Acta, 2007, 592, 1, 72-81, https://doi.org/10.1016/j.aca.2007.04.009
. [all data]
Takeoka, Hobbs, et al., 2010
Takeoka, G.R.; Hobbs, C.; Byeoung-Soo, P.,
Volatile constituents of the aerial parts of Salvia apiana Jepson,
J. Essential Oil. Res., 2010, 22, 3, 241-244, https://doi.org/10.1080/10412905.2010.9700314
. [all data]
Zouari, Zouari, et al., 2010
Zouari, S.; Zouari, N.; Fakhfakh, N.; Bougatel, A.; Ayadi, M.A.; Neffati, M.,
Chemical composition and biological activities of a new essential oil chemotype of Tunisian Artemisia herba alba Asso,
J. Medicinal Plants Res., 2010, 4, 10, 871-880. [all data]
Museli, Pau, et al., 2009
Museli, A.; Pau, M.; Desjobert, J.-M.; Foddai, M.; Usai, M.; Costa, J.,
Volatile constituents of Achllea ligustica All. by HS-SPME/GC/GC-MS. Comparison with essential oils obtained by hydrodistillation from Corsica and Sardinia,
Chromatographia, 2009, 69, 5/6, 575-585, https://doi.org/10.1365/s10337-008-0939-1
. [all data]
Adams, Beauchamp, et al., 2007
Adams, R.P.; Beauchamp, P.S.; Dev, V.; Dutz, S.M.,
New Natural Products Isolated from One-Seeded Juniperus of the Southwestern United States: Isolation and Occurence of 2-Ethenyl-3-methyl Phanol and Its Derivatives,
J. Essent. Oil Res., 2007, 19, 2, 146-152, https://doi.org/10.1080/10412905.2007.9699247
. [all data]
Bos, Woerdenbag, et al., 2007
Bos, R.; Woerdenbag, H.J.; Kayser, O.; Quax, W.J.; Ruslan, K.; Elfami,
Essential oil constituents of Piper cubeba L. fils. from Indonesia,
J. Essent. Oil Res., 2007, 19, 1, 14-17, https://doi.org/10.1080/10412905.2007.9699217
. [all data]
Cheraif, Ben Jannet, et al., 2007
Cheraif, I.; Ben Jannet, H.; Hammami, M.; Khouja, M.L.; Mighri, Z.,
Chemical composition and antimicrobial activity of essential oils of Cupressus arizonica Greene,
Biochem. Syst. Ecol., 2007, 35, 12, 813-820, https://doi.org/10.1016/j.bse.2007.05.009
. [all data]
Elfami, Bos, et al., 2007
Elfami; Bos, R.; Ruslan, K.; Woerdenbag, H.J.; Kayser, P.; Quax, W.J.,
Essential Oil Constituents of Piper cubeba from Indonesia, 2007, 53-60. [all data]
Ghasemi, Yamini, et al., 2007
Ghasemi, E.; Yamini, Y.; Bahramifar, N.; Sefidkon, F.,
Comparative analysis of the oil and supercritical CO2 extract of Artemisia sieberi,
J. Food Eng., 2007, 79, 1, 306-311, https://doi.org/10.1016/j.jfoodeng.2006.01.059
. [all data]
Mohottalage, Tabacchi, et al., 2007
Mohottalage, S.; Tabacchi, R.; Guerin, P.M.,
Components from Sri Lankan Piper betle L. leaf oil and their analogues showing toxicity against the housefly, Musca domestica,
Flavour Fragr. J., 2007, 22, 2, 130-138, https://doi.org/10.1002/ffj.1770
. [all data]
Tzakou, Bazos, et al., 2007
Tzakou, O.; Bazos, I.; Yannitsaros, A.,
Volatile metabolites of Pistacia atlantica Desf. from Greece,
Flavour Fragr. J., 2007, 22, 5, 358-362, https://doi.org/10.1002/ffj.1805
. [all data]
Borges, Rojas, et al., 2006
Borges, R.; Rojas, L.B.; Cegarra, J.A.; Usubillaga, A.,
Study of the essential oils from the leaves and flowers of Lepechinia conferta (Benth) Epl.,
Flavour Fragr. J., 2006, 21, 1, 155-157, https://doi.org/10.1002/ffj.1550
. [all data]
Cavaleiro, Pinto, et al., 2006
Cavaleiro, C.; Pinto, E.; Gonsales, M.J.; Salguero, L.,
Antifungal activity of Juniperus essential oils agains dermatophyte, Asrgillus and Candida strains,
J. Appl. Microbiol., 2006, 100, 6, 1333-1338, https://doi.org/10.1111/j.1365-2672.2006.02862.x
. [all data]
Coronel, Cerda-Garcia-Rojas, et al., 2006
Coronel, A. del.C.; Cerda-Garcia-Rojas, C.M.; Joseph-Nathan, P.; Catalán, C.A.N.,
Chemical composition, seasonal variation and a new sesquiterpene alcohol from the essential oil of Lippia integrifolia,
Flavour Fragr. J., 2006, 21, 5, 839-847, https://doi.org/10.1002/ffj.1736
. [all data]
Elfami, Komar, et al., 2006
Elfami, R.B.; Komar, R.; Woerdenbag, H.J.; Kayser, P.; Quax, W.J.,
Essential oil constituents of Piper cubeba from Indonesia, 2006, retrieved from http://dissertations.ub.rug.nl/FILES/facultiew/science/2006/elfahmi/05c5.pdf. [all data]
Lis and Milczarek, 2006
Lis, A.; Milczarek, J.,
Chemical composition of the essential oils from fruits, leaves and flowers of Phellodendron sachalinense (Fr. Schmidt) Sarg.,
Flavour Fragr. J., 2006, 21, 4, 683-686, https://doi.org/10.1002/ffj.1662
. [all data]
Pino, Marbot, et al., 2006
Pino, J.A.; Marbot, R.; Payo, A.; Chao, D.; Herrera, P.,
Aromatic Plants from Western Cuba VII. Composition of the Leaf Oil of Psidium wrightii KRug et Urb., Lantana involucrata L., Cinnamonum montanum (Sw.) Berchtold et J. Persl. and Caesalpinia violacea (Mill.) Standley,
J. Essent. Oil. Res., 2006, 18, 2, 170-174, https://doi.org/10.1080/10412905.2006.9699058
. [all data]
Sonboli, Mirjalili, et al., 2006
Sonboli, A.; Mirjalili, M.H.; Yousefzadi, M.,
Antimicrobial activity and composition of the essential oil of Cymbopogon Olivieri (Boiss.) Bor from Iran,
Iranian J. Pharm. Res., 2006, 1, 65-68. [all data]
Khayyat and Karimi, 2005
Khayyat, M.H.; Karimi, H.,
Composition of the volatile oils of three different species of Artemisia,
Iranian Journal of Pharmaceutical Sciences, 2005, 1, 1, 29-32. [all data]
Skoula and Grayer, 2005
Skoula, M.; Grayer, R.J.,
Volatile oils of Coridothymus capitatus, Satureja thymbra, Satureja spinosa and Thymbra calostachya (Lamiaceae) from Crete,
Flavour Fragr. J., 2005, 20, 6, 573-576, https://doi.org/10.1002/ffj.1489
. [all data]
Tzakou, Bazos, et al., 2005
Tzakou, O.; Bazos, I.; Yannitsaros, A.,
Essential oils of leaves, inflorescences and infructescences of spontaneous Cotinus coggygria Scop. from Greece,
Flavour Fragr. J., 2005, 20, 5, 531-533, https://doi.org/10.1002/ffj.1456
. [all data]
Agnihotri, Thappa, et al., 2004
Agnihotri, V.K.; Thappa, R.K.; Meena, B.; Kapahi, B.K.; Saxena, R.K.; Qazi, G.N.; Agarwal, S.G.,
Essential oil composition of aerial parts of Angelica glauca growing wild in North-West Himalaya (India),
Phytochemistry, 2004, 65, 16, 2411-2413, https://doi.org/10.1016/j.phytochem.2004.07.004
. [all data]
Edris and Farrag, 2003
Edris, A.E.; Farrag, E.S.,
Antifungal activity of peppermint and sweet basil essential oils and their major aroma constituents on some plant pathogenic fungi from the vapor phase,
Nahrung/Food, 2003, 47, 2, 117-121, https://doi.org/10.1002/food.200390021
. [all data]
Edris, Shalaby, et al., 2003
Edris, A.E.; Shalaby, A.; Fadel, H.M.,
Effect of organic agriculture practices on the volatile aroma components of some essential oil plants growing in Egypt II: sweet Marjoram (Origanum marjorana L.) essential oil,
Flavour Fragr. J., 2003, 18, 4, 345-351, https://doi.org/10.1002/ffj.1235
. [all data]
Masotti, Juteau, et al., 2003
Masotti, V.; Juteau, F.; Bessière, J.M.; Viano, J.,
Seasonal and phenological variations of the essential oil from the narrow endemic species Artemisia molinieri and its biological activities,
J. Agric. Food Chem., 2003, 51, 24, 7115-7121, https://doi.org/10.1021/jf034621y
. [all data]
Pino, Marbot, et al., 2003
Pino, J.A.; Marbot, R.; Fuentes, V.,
Characterization of volatiles in Bullock's heart (Annona reticulata L.) fruit cultivars from Cuba,
J. Agric. Food Chem., 2003, 51, 13, 3836-3839, https://doi.org/10.1021/jf020733y
. [all data]
Pitarokili, Tzakou, et al., 2003
Pitarokili, D.; Tzakou, O.; Loukis, A.; Harvala, C.,
Volatile metabolites from Salvia fruticosa as antifungal agents in soilborne pathogens,
J. Agric. Food Chem., 2003, 51, 11, 3294-3301, https://doi.org/10.1021/jf0211534
. [all data]
Shahmir, Ahmadi, et al., 2003
Shahmir, F.; Ahmadi, L.; Mirza, M.; Korori, S.A.A.,
Secretory elements of needles and berries of Juniperus communis L. ssp. communis and its volatile constituents,
Flavour Fragr. J., 2003, 18, 5, 425-428, https://doi.org/10.1002/ffj.1243
. [all data]
Bos, Koulman, et al., 2002
Bos, R.; Koulman, A.; Woerdenbag, H.J.; Quax, W.J.; Pras, N.,
Volatile components from Anthriscus sylvestris (L.) Hoffm.,
J. Chromatogr. A, 2002, 966, 1-2, 233-238, https://doi.org/10.1016/S0021-9673(02)00704-5
. [all data]
Cavaleiro, Salgueiro, et al., 2002
Cavaleiro, C.; Salgueiro, L.; Barroso, J.G.; Figueiredo, A.C.; Pedro, L.G.; Fontinha, S.S.; Bighelli, A.; Casanova, J.; Looman, A.; Scheffer, J.J.C.,
Composition of the essential oil of Juniperus cedrus Webb and Berth. grown on Madeira,
Flavour Fragr. J., 2002, 17, 2, 111-114, https://doi.org/10.1002/ffj.1061
. [all data]
Novak, Langbehn, et al., 2002
Novak, J.; Langbehn, J.; Pank, F.; Franz. C.M.,
Essential oil compounds in a historical sample of marjoram (Origanum majorana L., Lamiaceae),
Flavour Fragr. J., 2002, 17, 3, 175-180, https://doi.org/10.1002/ffj.1077
. [all data]
Kalemba, 1999
Kalemba, D.,
Constituents of the essential oil of Artemisia asiatica Nakai,
Flavour Fragr. J., 1999, 14, 3, 173-176, https://doi.org/10.1002/(SICI)1099-1026(199905/06)14:3<173::AID-FFJ805>3.0.CO;2-Q
. [all data]
Koulman, 1999
Koulman, A.,
Podophyllotoxin: a study of biosynthesis, evolution, function, and use of podophyllotoxin and related lignans, University Library Groningen, Nederlands, 1999, 188, retrieved from http://www.ub.rug.nl/eldoc/dis/science/a.koulman/. [all data]
Maia, Zohhbi, et al., 1998
Maia, J.G.S.; Zohhbi, M.G.B.; Andrade, E.H.A.; Santos, A.S.; da Silva, M.H.L.; Luz, A.I.R.; Bastos, C.N.,
Constituents of the essential oil of Piper aduncum L. growing wild in the Amazon region,
Flavour Fragr. J., 1998, 13, 4, 269-272, https://doi.org/10.1002/(SICI)1099-1026(1998070)13:4<269::AID-FFJ744>3.0.CO;2-A
. [all data]
Kollmannsberger, Nitz, et al., 1992
Kollmannsberger, H.; Nitz, S.; Drawert, F.,
UBer die Aromastoffzusammensetzung von Hochdruckextrakten. I. Pfeffer (Piper nigrum, Var. muntok),
Z. Lebensm. Unters Forsch., 1992, 194, 6, 545-551, https://doi.org/10.1007/BF01185481
. [all data]
Brophy, Davies, et al., 1989
Brophy, J.J.; Davies, N.W.; Southwell, I.A.; Stiff, I.A.; Williams, L.R.,
Gas chromatographic quality control for oil of Melaleuca terpinen-4-ol type (Australian tea tree),
J. Agric. Food Chem., 1989, 37, 5, 1330-1335, https://doi.org/10.1021/jf00089a027
. [all data]
Bai, Liu, et al., 2011
Bai, C.Q.; Liu, Z.L.; Liu, Q.Z.,
Nematicidal constituents from the essential oil of Chenopodium ambrosioides aerial parts,
E-Journal of Chemistry, 2011, 8, S1, s143-s148, https://doi.org/10.1155/2011/470862
. [all data]
Chaverri, Diaz, et al., 2011
Chaverri, C.; Diaz, C.; Cicco, J.F.,
Chemical analysis of essential oils from Ocotea gomezii W.C. Burger and Ocotea morae Gomez-Laur. (Lauraceae) collected at Reserva biologica Alberto M. Brenes in Costa Rica and their cytotoxic activity on Tumor cell lines,
J. Braz. Chem. Soc., 2011, 22, 4, s1-s4, https://doi.org/10.1590/S0103-50532011000400018
. [all data]
Ning, Zheng, et al., 2008
Ning, H.; Zheng, F.; Sun, B.; Xie, J.; Liu, Y.,
Solvent-free microwave extraction of essential oil from Zanthoxylum bungeanum Maxim.,
Food Environ. Ind. (Chinese), 2008, 34, 5, 179-184. [all data]
Zachariah, Leela, et al., 2008
Zachariah, T.J.; Leela, N.K.; Maya, K.M.; Rema, J.; Mathew, P.A.; Vipin, T.M.; Krishnamoorthy, B.,
Chemical composition of leaf oils of Myristica beddomeii (King), Myristica fragrans (Houtt.) and Myristica malabarica (Lamk.),
J. Spices Arom. Crops, 2008, 17, 1, 10-15. [all data]
Cole, Haber, et al., 2007
Cole, R.A.; Haber, W.A.; Setzer, W.N.,
Chemical composition of essential oils of seven species of Eugenia from Monteverde, Costa Rica,
Biochem. Syst. Ecol., 2007, 35, 12, 877-886, https://doi.org/10.1016/j.bse.2007.06.013
. [all data]
Nivinsliene, Butkiene, et al., 2007
Nivinsliene, O.; Butkiene, R.; Gudalevic, A.; Mockute, D.; Meskauskiene, V.; Grigaliunaite, B.,
Influence of urban environment on chemical composition of Tilia cordata essential oil,
Chemija, 2007, 18, 1, 44-49. [all data]
Radudienë, Judpintienë, et al., 2005
Radudienë, J.; Judpintienë, A.; Peèiulytë, D.; Janulis, V.,
Chemical composition of essential oil and antimicrobial activity of Origanum vulgare,
Biologija, 2005, 4, 53-58. [all data]
El-Shazily, Hafez, et al., 2004
El-Shazily, A.M.; Hafez, S.S.; Wink, M.,
Comparative study of the essential oils and extracts of Achillea fragrantissima (Forssk.) Sch. Bip. and Achillea santolina L. (Asteraceae) from Egypt,
Pharmazie, 2004, 59, 226-230. [all data]
Judpentienë and Mockutë, 2004
Judpentienë, A.; Mockutë, D.,
Chemical composition of essential oils of Artemisia absinthium L. (wormwood) growing wild in Vilnius,
Chemija, 2004, 15, 4, 64-68. [all data]
Senatore, Apostolides Arnold, et al., 2004
Senatore, F.; Apostolides Arnold, N.; Piozzi, F.,
Chemical composition of the essential oil of Salvia multicaulis Vahl. var. simplicifolia Boiss. growing wild in Lebanon,
J. Chromatogr. A, 2004, 1052, 1-2, 237-240, https://doi.org/10.1016/j.chroma.2004.08.095
. [all data]
Singh, Marimuthu, et al., 2004
Singh, G.; Marimuthu, P.; Catalan, C.; deLampasona, M.P.,
Chemical, antioxidant and antifungal activities of volatile oil of black pepper and its acetone extract,
J. Sci. Food Agric., 2004, 84, 14, 1878-1884, https://doi.org/10.1002/jsfa.1863
. [all data]
Tepe, Donmez, et al., 2004
Tepe, B.; Donmez, E.; Unlu, M.; Candan, F.; Daferera, D.; Vardar-Unlu, G.; Polissiou, M.; Sokmen, A.,
Antimicrobial and antioxidative activities of the essential oils and methanol extracts of Salvia cryptantha (Montbret et Aucher ex Benth.) and Salvia multicaulis (Vahl),
Food Chem., 2004, 84, 4, 519-525, https://doi.org/10.1016/S0308-8146(03)00267-X
. [all data]
Vinogradov, 2004
Vinogradov, B.A.,
Production, composition, properties and application of essential oils, 2004, retrieved from http://viness.narod.ru. [all data]
Weyerstahl, Marschall, et al., 1999, 2
Weyerstahl, P.; Marschall, H.; Splittgerber, U.; Son, P.T.; Giang, P.M.; Kaul, V.K.,
Constituents of the essential oil from the fruits of Zanthoxylum rhetsoides Drake from Vietnam and from the aerial parts of Zanthoxylum alatum Roxb. from India,
Flavour Fragr. J., 1999, 14, 4, 225-229, https://doi.org/10.1002/(SICI)1099-1026(199907/08)14:4<225::AID-FFJ818>3.0.CO;2-1
. [all data]
Zenkevich, 1997
Zenkevich, I.G.,
Analytical Parameters of Components of Essential Oils for their Chromatographic and Chromato-Spectral Identificaiton. Oxsigenated derivatives of Mono- and Sesquiterpene Hydrocarbons,
Rastit, Resursy (Rus.), 1997, 33, 1, 16-28. [all data]
Jirovetz, Buchbauer, et al., 2005
Jirovetz, L.; Buchbauer, G.; Ngassoum, M.B.; Parmentier, M.,
Chemical composition and olfactory characterization of essential oils of fruits and seeds of African pear (Dacryodes edulis (G. Don) H. J. Lam) from Cameroon,
Flavour Fragr. J., 2005, 20, 2, 215-218, https://doi.org/10.1002/ffj.1324
. [all data]
Lourens, Reddy, et al., 2004
Lourens, A.C.U.; Reddy, D.; Baser, K.H.C.; Viljoen, A.M.; Van Vuuren, S.F.,
In vitro Biological Activity and Essential Oil Composition of Four Indigenous South Africal Helichrysum Species,
J. Ethnopharmacol., 2004, 95, 2-3, 253-258, https://doi.org/10.1016/j.jep.2004.07.027
. [all data]
Christoph, 2001
Christoph, F.,
Chemische Zuzammensetzung und antimikrobielle Eigenschaften der ätherischen Öle von Leptospermum scoparium J. R. et G. Forst. und anderer Teebaumöle der Gattungen Kunzea, Leptospermum und Melaleuca unter besonderer Berücksichtigung von Handelsölen, Dissertation, University of Hamburg, Germany, 2001, 196. [all data]
Onocha, Ekundayo, et al., 1999
Onocha, P.A.; Ekundayo, O.; Oyelola, O.; Laakso, I.,
Essential oils of Dacryodes edulis (G. Don) H. J. Lam (African pear),
Flavour Fragr. J., 1999, 14, 2, 135-139, https://doi.org/10.1002/(SICI)1099-1026(199903/04)14:2<135::AID-FFJ788>3.0.CO;2-L
. [all data]
Baser, Kirimer, et al., 1997
Baser, K.H.C.; Kirimer, N.; Duman, H.,
Composition of the essential oil of Micromeria dolichodontha P. H. Davis,
Flavour Fragr. J., 1997, 12, 4, 289-291, https://doi.org/10.1002/(SICI)1099-1026(199707)12:4<289::AID-FFJ640>3.0.CO;2-A
. [all data]
Nykanen, 1986
Nykanen, I.,
High Resolution Gas Chromatographic - Mass Spectrometric determination of the Flavour Composition of Wild Majoram (Origanum vulgare L.) Cultivated in Finland,
Z. Lebensm Unters Forsch, 1986, 183, 4, 267-272, https://doi.org/10.1007/BF01087742
. [all data]
Polatoglu, Demirci, et al., 2010
Polatoglu, K.; Demirci, F.; Demirci, B.; Goren, N.; Baser, K.H.C.,
Antimicrobial activity and essential oil composition of a new T. argyrophyllum (C. Koch) Tvzel var. argyrophyllium chemotype,
J. Oleo Sci., 2010, 59, 6, 307-313, https://doi.org/10.5650/jos.59.307
. [all data]
Baser, Demirci, et al., 2009
Baser, K.H.C.; Demirci, B.; Kurkcuoglu, M.; Satin, F.; Tumen, G.,
Comparative morphological and phytochemical charactertization of Salvia cadmica and S. smyrnaea,
Pak. J. Bot., 2009, 41, 4, 1545-1555. [all data]
Wedge, Klun, et al., 2009
Wedge, D.E.; Klun, J.A.; Tabanca, N.; Demirci, B.; Ozek, T.; Baser, K.H.C.; Liu, Z.; Zhang, S.; Cantrell, C.L.; Zhang, J.,
Bioactivity-guided fractionation and GC/MS fingerprinting of Amgelica sinensis and Angelica archangelica root components for antifungal and mosquito deterrent activity,
J. Agric. Food Chem., 2009, 57, 2, 464-470, https://doi.org/10.1021/jf802820d
. [all data]
Tabanca N., Demirci B., et al., 2007
Tabanca N.; Demirci B.; Crockett S.L.; Baser K.H.C.; Wedge D.E.,
Chemical composition and antifungal activity of Arnica longifolia, Aster hesperius, and Chrysothamnus nauseosus essential oils,
J. Agric. Food Chem., 2007, 55, 21, 8430-8435, https://doi.org/10.1021/jf071379c
. [all data]
Demirci B., Baser K.H.C., et al., 2006
Demirci B.; Baser K.H.C.; Tabanca N.; Wedge D.E.,
Characterization of volatile constituents of Haplopappus greenei and studies on the antifungal activity against phytopathogens,
J. Agric. Food Chem., 2006, 54, 8, 3146-3150, https://doi.org/10.1021/jf053222v
. [all data]
Iscan, Kirimer, et al., 2006
Iscan, G.; Kirimer, N.; Kurkcuoglu, M.; Arabaci, T.; Kupeli, E.; Baser, K.H.C.,
Biological Activity and Composition of the Essential Oils of Achillea schischkinii Sosn. and Achillea aleppica DC. subsp. aleppica,
J. Agric. Food Chem., 2006, 54, 1, 170-173, https://doi.org/10.1021/jf051644z
. [all data]
Kürkçüoglu, Hüsnü Can Baser, et al., 2006
Kürkçüoglu, M.; Hüsnü Can Baser, K.; Iscan, G.; Malyer, H.; Kaynak, G.,
Composition and anticandidal activity of the essential oil of Chaerophyllum byzantinum Boiss.,
Flavour Fragr. J., 2006, 21, 1, 115-117, https://doi.org/10.1002/ffj.1539
. [all data]
Suleimenov Y.M., Atazhanova G.A., et al., 2006
Suleimenov Y.M.; Atazhanova G.A.; Ozek T.; Demirci B.; Kulyyasov A.T.; Adekenov S.M.; Baser K.H.C.,
Essential oil composition of three species of Achillea from Kazakhstan,
Chem. Nat. Compd. (Engl. Transl.), 2006, 37, 5, 447-450, https://doi.org/10.1023/A:1014471326724
. [all data]
Demirci, Demirci, et al., 2005
Demirci, B.; Demirci, F.; Baser, K.H.C.,
Headspace-SPME and hydrodistillation of two fragrant Artemisia sp.,
Flavour Fragr. J., 2005, 20, 4, 395-398, https://doi.org/10.1002/ffj.1426
. [all data]
Viljoen, Subramoney, et al., 2005
Viljoen, A.M.; Subramoney, S.; van Vuuren, S.F.; Baser, K.H.C.; Demirci, B.,
The composition, geographical variation and antimicrobial activity of Lippia javanica (Verbenaceae) leaf essential oils,
J. Ethnopharmacol., 2005, 96, 1-2, 271-277, https://doi.org/10.1016/j.jep.2004.09.017
. [all data]
Demirci, Paper, et al., 2004
Demirci, F.; Paper, D.H.; Franz, G.; Hüsnü Can Baser, K.,
Investigation of the origanum onites L. essential oil using the Chorioallantoic Membrane (CAM) assay,
J. Agric. Food Chem., 2004, 52, 2, 251-254, https://doi.org/10.1021/jf034850k
. [all data]
Kivcak, Akay, et al., 2004
Kivcak, B.; Akay, S.; Demirci, B.; Baser, K.H.C.,
Chemical composition of essential oils from leaves and twigs of Pistacia lentiscus, Pistacia lentiscus var. chia, and Pistacia terebinthus from Turkey,
Pharm. Biol, 2004, 42, 4-5, 360-366, https://doi.org/10.1080/13880200490519677
. [all data]
Demirci, Baser, et al., 2003
Demirci, B.; Baser, K.H.C.; Yildiz, B.; Bahcecioglu, Z.,
Composition of the essential oils of six endemic Salvia spp. from Turkey,
Flavour Fragr. J., 2003, 18, 2, 116-121, https://doi.org/10.1002/ffj.1173
. [all data]
Kaya, Demirci, et al., 2003
Kaya, A.; Demirci, B.; Baser, K.H.C.,
The essential oil of Seseli tortuosum L. growing in Turkey,
Flavour Fragr. J., 2003, 18, 2, 159-161, https://doi.org/10.1002/ffj.1162
. [all data]
Kürkcüoglu, Demirci, et al., 2003
Kürkcüoglu, M.; Demirci, B.; Tabanca, N.; Özek, T.; Baser, K.H.C.,
The essential oil of Achillea falcata L.,
Flavour Fragr. J., 2003, 18, 3, 192-194, https://doi.org/10.1002/ffj.1176
. [all data]
Viljoen, van Vuuren, et al., 2003
Viljoen, A.; van Vuuren, S.; Ernst, E.; Klepser, M.; Demirci, B.; Baser, H.; van Wyk, B.-E.,
Osmitopsis asteriscoides (Asteraceae)-the antimicrobial activity and essential oil composition of a Cape-Dutch remedy,
J. Ethnopharmacol., 2003, 88, 2-3, 137-143, https://doi.org/10.1016/S0378-8741(03)00191-0
. [all data]
Baser, Demirci, et al., 2002
Baser, K.H.C.; Demirci, B.; Kirimer, N.; Satil, F.; Tumen, G.,
The essential oils of Thymus migricus and T. fedtschenkoi var. handelii from Turkey,
Flavour Fragr. J., 2002, 17, 1, 41-45, https://doi.org/10.1002/ffj.1036
. [all data]
Baser, Demirei, et al., 2002
Baser, K.H.C.; Demirei, B.; Özek, T.; Akalin, E.; Özhatay, N.,
Micro-distilled volatile compounds from Ferulago species growing in Western Turkey,
Pharm. Biol., 2002, 40, 6, 466-471, https://doi.org/10.1076/phbi.40.6.466.8439
. [all data]
Baser, Nuriddinov, et al., 2002
Baser, K.H.C.; Nuriddinov, H.R.; Ozek, T.; Demirci, A.B.; Azcan, N.; Nigmatullaev, A.M.,
Essential oil of Arischrada korolkowii from the Chatkal mountains of Uzbekistan,
Chem. Nat. Compd. (Engl. Transl.), 2002, 38, 1, 51-53, https://doi.org/10.1023/A:1015729731464
. [all data]
Hüsnü Can Baser, Demirci, et al., 2002
Hüsnü Can Baser, K.; Demirci, B.; Femirci, F.; Kocak, S.; Akinci, C.; Malyer, H.; Güleryüz, G.,
Composition and antimicrobial activity of the essential oil of Achellea multifida,
Planta Medica, 2002, 68, 10, 941-943, https://doi.org/10.1055/s-2002-34923
. [all data]
Tunalier, Kirimer, et al., 2002
Tunalier, Z.; Kirimer, N.; Baser, K.H.C.,
The composition of essential oils from various parts of Juniperus foetidissima,
Chem. Nat. Compd. (Engl. Transl.), 2002, 38, 1, 43-47, https://doi.org/10.1023/A:1015725630556
. [all data]
Baser, Demirci, et al., 2001
Baser, K.H.C.; Demirci, B.; Tabanca, N.; Özek, T.; Gören, N.,
Composition of the essential oils of Tanacetum armenum (DC.) Schultz Bip., T. balsamita L., T. chiliophyllum (Fisch. Mey.) Schultz Bip. var. chiliophyllum and T. haradjani (Rech. fil.) Grierson and the enantiomeric distribution of camphor and carvone,
Flavour Fragr. J., 2001, 16, 3, 195-200, https://doi.org/10.1002/ffj.977
. [all data]
Gören, Demirci, et al., 2001
Gören, N.; Demirci, B.; Baser, K.H.C.,
Composition of the essential oils of Tanacetum spp. from Turkey,
Flavour Fragr. J., 2001, 16, 3, 191-194, https://doi.org/10.1002/ffj.976
. [all data]
Özcan, Akgül, et al., 2001
Özcan, M.; Akgül, A.; Bascr, K.H.C.; Özck, T.; Tabanca, N.,
Essential oil composition of sea fennel (Crithmum maritimum) form Turkey,
Nahrung/Food, 2001, 45, 5, 353-356, https://doi.org/10.1002/1521-3803(20011001)45:5<353::AID-FOOD353>3.0.CO;2-4
. [all data]
Baser, Özek, et al., 2000
Baser, K.H.C.; Özek, T.; Demirci, B.; Duman, H.,
Composition of the essential oil of Glaucosciadium cordifolium (Boiss.) Burtt et Davis from Turkey,
Flavour Fragr. J., 2000, 15, 1, 45-46, https://doi.org/10.1002/(SICI)1099-1026(200001/02)15:1<45::AID-FFJ867>3.0.CO;2-L
. [all data]
Baser, Tabanca, et al., 2000
Baser, K.H.C.; Tabanca, N.; Özek, T.; Demirci, B.; Duran, A.; Duman, H.,
Composition of the essential oil of Chaerophyllum aksekiense A. Duran et Duman, a recently described endemic from Turkey,
Flavour Fragr. J., 2000, 15, 1, 43-44, https://doi.org/10.1002/(SICI)1099-1026(200001/02)15:1<43::AID-FFJ864>3.0.CO;2-#
. [all data]