1,1,2,2,3-pentachloropropane
- Formula: C3H3Cl5
- Molecular weight: 216.321
- IUPAC Standard InChIKey: IYFMQUDCYNWFTL-UHFFFAOYSA-N
- CAS Registry Number: 16714-68-4
- Chemical structure:
View 3d structure (requires JavaScript / HTML 5) - Permanent link for this species. Use this link for bookmarking this species for future reference.

Phase change data

Data compiled by: William E. Acree, Jr., James S. Chickos
Enthalpy of vaporization
ΔvapH (kJ/mol) | Temperature (K) | Method | Reference | Comment |
---|---|---|---|---|
46.3 | 380. | A | Stephenson and Malanowski, 1987 | Based on data from 365. to 447. K. See also Dykyj, 1970. |

References

Stephenson and Malanowski, 1987
Stephenson, Richard M.; Malanowski, Stanislaw,
Handbook of the Thermodynamics of Organic Compounds, 1987, https://doi.org/10.1007/978-94-009-3173-2
. [all data]
Dykyj, 1970
Dykyj, J.,
Petrochemica, 1970, 10, 2, 51. [all data]