2-Acetylcyclopentanone
- Formula: C7H10O2
- Molecular weight: 126.1531
- IUPAC Standard InChIKey: OSWDNIFICGLKEE-UHFFFAOYSA-N
- CAS Registry Number: 1670-46-8
- Chemical structure:
View 3d structure (requires JavaScript / HTML 5) - Other names: Acetylcyclopentanone; Cyclopentanone, 2-acetyl-; 2-acetylcyclopentan-1-one

Phase change data

Data compiled by: Robert L. Brown and Stephen E. Stein
Reduced pressure boiling point
Tboil (K) | Pressure (bar) | Reference |
---|---|---|
346.7 | 0.01 | Aldrich Chemical Company Inc., 1990 |
374. to 376. | 0.032 | Buckingham and Donaghy, 1982 |
358. to 363. | 0.020 | Buckingham and Donaghy, 1982 |

References

Aldrich Chemical Company Inc., 1990
Aldrich Chemical Company Inc.,
Catalog Handbook of Fine Chemicals, Aldrich Chemical Company, Inc., Milwaukee WI, 1990, 1. [all data]
Buckingham and Donaghy, 1982
Buckingham, J.; Donaghy, S.M.,
Dictionary of Organic Compounds: Fifth Edition, Chapman and Hall, New York, 1982, 1. [all data]