N,N-Dimethyl-2,4-dinitro-aniline

Condensed phase thermochemistry data

Data compiled by: Hussein Y. Afeefy, Joel F. Liebman, and Stephen E. Stein

Quantity Value Units Method Reference Comment
Δfliquid-30.7 ± 6.7kJ/molCcbMedard and Thomas, 1955Reanalyzed by Cox and Pilcher, 1970, Original value = -27. kJ/mol

References

Medard and Thomas, 1955
Medard, L.; Thomas, M., Chaleurs de combustion de treize substances explosives ou apparentees a des explosifs, Mem. Poudres, 1955, 38, 46-63. [all data]

Cox and Pilcher, 1970
Cox, J.D.; Pilcher, G., Thermochemistry of Organic and Organometallic Compounds, Academic Press, New York, 1970, 1-636. [all data]