7-Dodecenol
- Formula: C12H24O
- Molecular weight: 184.3184
- IUPAC Standard InChIKey: WWDOVTHLTQFGOZ-UHFFFAOYSA-N
- CAS Registry Number: 16695-40-2
- Chemical structure:
View 3d structure (requires JavaScript / HTML 5) - Stereoisomers:
- Other names: 7-Dodecen-1-ol; (E) 7-dodecen-1-ol

Phase change data

Data compiled by: William E. Acree, Jr., James S. Chickos
Quantity | Value | Units | Method | Reference | Comment |
---|---|---|---|---|---|
ΔvapH° | 90.8 | kJ/mol | CGC | Ova, Koultek, et al., 2000 | Based on data from 333. to 373. K. See also Koutek, Hoskovec, et al., 1994. |

Kovats' RI, non-polar column, isothermal

Column type | Active phase | Temperature (C) | I | Reference | Comment |
---|---|---|---|---|---|
Packed | OV-101 | 130. | 1420. | Berezkin and Returnsky, 1984 | Chromaton N-AW; Column length: 1. m |

References

Ova, Koultek, et al., 2000
Ova, P.V.; Koultek, B.; Hoskovec, M.,
Practice Oriented Results on Use and Production of Neem Ingredients and Pheromones VI, H. Kleeberg and C.P.W. Zebitz, ed(s)., Druck and Graphic, Giessen, 2000, 211-218. [all data]
Koutek, Hoskovec, et al., 1994
Koutek, Bohumír; Hoskovec, Michal; Vrkocová, Pavlína; Konecný, Karel; Feltl, Ladislav,
Gas chromatographic determination of vapour pressures of pheromone-like compounds II. Alcohols,
Journal of Chromatography A, 1994, 679, 2, 307-317, https://doi.org/10.1016/0021-9673(94)80573-3
. [all data]
Berezkin and Returnsky, 1984
Berezkin, V.G.; Returnsky, V.N.,
Calculation of invariant retention indices for a series of aliphatic alcohols and acetates by consideration of adsorption at the interface,
J. Chromatogr., 1984, 292, 1, 9-17, https://doi.org/10.1016/S0021-9673(01)96185-0
. [all data]