Diethylene glycol, 2TMS derivative
- Formula: C10H26O3Si2
- Molecular weight: 250.4826
- IUPAC Standard InChIKey: VZCNNAQIFXLAEZ-UHFFFAOYSA-N
- CAS Registry Number: 16654-74-3
- Chemical structure:
View 3d structure (requires JavaScript / HTML 5) - Other names: 3,6,9-Trioxa-2,10-disilaundecane, 2,2,10,10-tetramethyl-; Diethylene glycol, bistrimethylsilyl ether; 2,2,10,10-Tetramethyl-3,6,9-trioxa-2,10-disilaundecane; Trimethyl-[2-(2-trimethylsilyloxyethoxy)ethoxy]silane

Van Den Dool and Kratz RI, non-polar column, custom temperature program

Column type | Active phase | I | Reference | Comment |
---|---|---|---|---|
Capillary | VF-5MS | 1227.1 | Tret'yakov, 2008 | 30. m/0.25 mm/0.25 μm, He; Program: Multi-step temperature program; T(initial)=60C; T(final)=270C |
Capillary | VF-5MS | 1238.7 | Zheng and White, 2008 | 30. m/0.25 mm/0.25 μm, He; Program: not specified |

References

Tret'yakov, 2008
Tret'yakov, K.V.,
Retention Data. NIST Mass Spectrometry Data Center., NIST Mass Spectrometry Data Center, 2008. [all data]
Zheng and White, 2008
Zheng, Y.; White, E.,
Retention Data. NIST Mass Spectrometry Data Center., NIST Mass Spectrometry Data Center, 2008. [all data]