Methane-D2-, dichloro-
- Formula: CD2Cl2
- Molecular weight: 86.945
- IUPAC Standard InChIKey: YMWUJEATGCHHMB-DICFDUPASA-N
- CAS Registry Number: 1665-00-5
- Chemical structure:
View 3d structure (requires JavaScript / HTML 5) - Isotopologues:
- Other names: Methylene chloride-D2; CD2Cl2; dichloro(2H2)methane; Dichloromethane-d2

Vibrational and/or electronic energy levels

Data compiled by: Takehiko Shimanouchi
Symmetry: C2ν Symmetry Number σ = 2
Sym. | No | Approximate | Selected Freq. | Infrared | Raman | Comments | ||||
---|---|---|---|---|---|---|---|---|---|---|
Species | type of mode | Value | Rating | Value | Phase | Value | Phase | |||
a1 | 1 | CD2 s-str | 2205 | B | 2205 W | gas | 2198 M p | liq. | ||
a1 | 2 | CD2 scis | 1052 | D | 1052 VW p | liq. | ||||
a1 | 3 | CCl2 s-str | 687 | B | 687 M | gas | 677 VS p | liq. | ||
a1 | 4 | CCl2 scis | 282 | C | 282 S p | liq. | ||||
a2 | 5 | CD2 twist | 826 | C | ia | 826 VW | liq. | |||
b1 | 6 | CD2 a-str | 2304 | C | 2304 | liq. | 2304 VW | liq. | ||
b1 | 7 | CD2 rock | 712 | D | Calculated from product rule [ν1] | |||||
b2 | 8 | CD2 wag | 957 | B | 957 VS | gas | ||||
b2 | 9 | CCl2 a-str | 727 | B | 727 VS | gas | 716 W | liq. | ||
Source: Shimanouchi, 1972

References

Shimanouchi, 1972
Shimanouchi, T.,
Tables of Molecular Vibrational Frequencies Consolidated Volume I, National Bureau of Standards, 1972, 1-160. [all data]