Di-t-butyldiazene N-oxide
- Formula: C8H18N2O
- Molecular weight: 158.2413
- IUPAC Standard InChIKey: YOGGJOULZPUAHF-KTKRTIGZSA-N
- CAS Registry Number: 16649-52-8
- Chemical structure:
View 3d structure (requires JavaScript / HTML 5) - Species with the same structure:

Phase change data

Data compiled as indicated in comments:
TRC - Thermodynamics Research Center, NIST Boulder Laboratories, Chris Muzny director
ALS - Hussein Y. Afeefy, Joel F. Liebman, and Stephen E. Stein
AC - William E. Acree, Jr., James S. Chickos
DH - Eugene S. Domalski and Elizabeth D. Hearing
Quantity | Value | Units | Method | Reference | Comment |
---|---|---|---|---|---|
Tfus | 288.4 | K | N/A | Byström, 1980 | Crystal phase 1 phase; Uncertainty assigned by TRC = 1. K; TRC |
Quantity | Value | Units | Method | Reference | Comment |
ΔvapH° | 10.98 ± 0.02 | kcal/mol | C | Bystrom, 1981 | ALS |
ΔvapH° | 11.0 ± 0.02 | kcal/mol | C | Bystrom, 1981 | AC |
Enthalpy of fusion
ΔfusH (kcal/mol) | Temperature (K) | Reference | Comment |
---|---|---|---|
2.753 | 288.4 | Byström, 1980 | AC |
Enthalpy of phase transition
ΔHtrs (kcal/mol) | Temperature (K) | Initial Phase | Final Phase | Reference | Comment |
---|---|---|---|---|---|
1.993 | 268.0 | crystaline, II | crystaline, I | Bystroem, 1980 | DH |
2.7533 | 288.4 | crystaline, I | Bystroem, 1980 | DH |
Entropy of phase transition
ΔStrs (cal/mol*K) | Temperature (K) | Initial Phase | Final Phase | Reference | Comment |
---|---|---|---|---|---|
7.43 | 268.0 | crystaline, II | crystaline, I | Bystroem, 1980 | DH |
9.54 | 288.4 | crystaline, I | Bystroem, 1980 | DH |

References

Byström, 1980
Byström, Katarina,
Solid--solid phase transitions in azoxy compounds,
J. Chem. Soc., Faraday Trans. 1, 1980, 76, 0, 1986, https://doi.org/10.1039/f19807601986
. [all data]
Bystrom, 1981
Bystrom, K.,
Enthalpies of combustion, vaporization, and formation for di-n-propyldiazene N-oxide and di-t-butyldiazene N-oxide,
J. Chem. Thermodyn., 1981, 13, 139-145. [all data]
Bystroem, 1980
Bystroem, K.,
Solid-solid phase transitions in azoxy compounds, J. Chem. Soc.,
Faraday Trans., 1980, 1 76(9), 1986-1990. [all data]