E,Z-3-Ethylidenecyclohexene
- Formula: C8H12
- Molecular weight: 108.1809
- IUPAC Standard InChIKey: HCKKIWXIMBMLCD-WAPJZHGLSA-N
- CAS Registry Number: 16631-62-2
- Chemical structure:
View 3d structure (requires JavaScript / HTML 5) - Species with the same structure:
- Stereoisomers:
- Other names: 3-EThylidenecyclohexene; (E and Z)-3-Ethylidenecyclohexene

Reaction thermochemistry data

Data compiled by: Hussein Y. Afeefy, Joel F. Liebman, and Stephen E. Stein
Individual Reactions
By formula: C8H12 = C8H12
Quantity | Value | Units | Method | Reference | Comment |
---|---|---|---|---|---|
ΔrH° | -12.0 ± 0.5 | kJ/mol | Eqk | Taskinen and Nummelin, 1994 | liquid phase; solvent: Dimethylsulfoxide |
By formula: C8H12 = C8H12
Quantity | Value | Units | Method | Reference | Comment |
---|---|---|---|---|---|
ΔrH° | -9.3 ± 1.3 | kJ/mol | Eqk | Taskinen and Nummelin, 1994 | liquid phase; solvent: Dimethylsulfoxide |
By formula: C8H12 = C8H12
Quantity | Value | Units | Method | Reference | Comment |
---|---|---|---|---|---|
ΔrH° | 2.0 ± 0.4 | kJ/mol | Eqk | Taskinen and Nummelin, 1994 | liquid phase; solvent: Dimethylsulfoxide |

References

Taskinen and Nummelin, 1994
Taskinen, E.; Nummelin, K.,
Relative thermodynamic stabilities of 3-ethylidenecyclohexenes and isomeric ethylcyclohexadienes,
Tetrahedron, 1994, 50, 11693-11698. [all data]