3-Phenyl-1-indanone
- Formula: C15H12O
- Molecular weight: 208.2552
- IUPAC Standard InChIKey: SIUOTMYWHGODQX-UHFFFAOYSA-N
- CAS Registry Number: 16618-72-7
- Chemical structure:
View 3d structure (requires JavaScript / HTML 5) - Other names: 3-Phenylindan-1-one; 1-Indanone, 3-phenyl-; 1H-Inden-1-one, 2,3-dihydro-3-phenyl-; 1H-Indene-1-one, 2,3-dihydro-3-phenyl-

Phase change data

Data compiled by: Robert L. Brown and Stephen E. Stein
Reduced pressure boiling point
Tboil (K) | Pressure (bar) | Reference |
---|---|---|
473. to 476. | 0.021 | Frinton Laboratories Inc., 1986 |

References

Frinton Laboratories Inc., 1986
Frinton Laboratories Inc.,
Catalog Number 11, Frinton Laboratories Inc., Vineland, NJ, 1986, 99. [all data]
Avram, et al., 1976
Avram, M., et al.,
Chem. Ber., 1976, 109, 1287. [all data]