2-(dodecylamino)ethanol
- Formula: C14H31NO
- Molecular weight: 229.4020
- IUPAC Standard InChIKey: HCYSJBICYOIBLS-UHFFFAOYSA-N
- CAS Registry Number: 16613-87-9
- Chemical structure:
View 3d structure (requires JavaScript / HTML 5) - Other names: Ethanol, 2-(dodecylamino)-

Reaction thermochemistry data

Data compiled by: Hussein Y. Afeefy, Joel F. Liebman, and Stephen E. Stein
Individual Reactions
By formula: C14H31NO = C12H27N + C2H4O
Quantity | Value | Units | Method | Reference | Comment |
---|---|---|---|---|---|
ΔrH° | -120.0 ± 4.6 | kJ/mol | Eqk | Balcerowiak, Jerzykiewicz, et al., 1984 | liquid phase |

References

Balcerowiak, Jerzykiewicz, et al., 1984
Balcerowiak, W.; Jerzykiewicz, W.; Szewczyk, H.,
Differential thermal analysis using closed pans. The ethoxylation of n-dodecylamine,
Tenside Deterg., 1984, 21, 10-11. [all data]