1-Adamantyl methyl ketone
- Formula: C12H18O
- Molecular weight: 178.2707
- IUPAC Standard InChIKey: DACIGVIOAFXPHW-UHFFFAOYSA-N
- CAS Registry Number: 1660-04-4
- Chemical structure:
- Other names: Ethanone, 1-tricyclo[3.3.1.1(3,7)-]dec-1-yl-; Ethanone, 1-tricyclo[3.3.1.13,7]dec-1-yl-; Ketone, 1-adamantyl methyl; 1-(1-Adamantyl)ethanone; 1-Acetyladamantane; Adamantyl methyl ketone; Methyl 1-adamantyl ketone; 1-Adamantan-1-yl-ethanone; Methyl adamantyl-1 ketone; 1-methyl adamantyl ketone; Adamantane, 1-acetyl; methyl tricyclo[3.3.1.13,7]dec-1-yl ketone

Gas phase thermochemistry data

Data compiled by: Hussein Y. Afeefy, Joel F. Liebman, and Stephen E. Stein
Quantity | Value | Units | Method | Reference | Comment |
---|---|---|---|---|---|
ΔfH°gas | -71.30 ± 0.76 | kcal/mol | Ccb | Abboud, Jimenez, et al., 1992 |

Kovats' RI, non-polar column, isothermal

Column type | Active phase | Temperature (C) | I | Reference | Comment |
---|---|---|---|---|---|
Packed | PMS-1000 | 230. | 1430. | Arutyunov, Kudryashov, et al., 2004 | N2, Chromaton N-AW-DMCS; Column length: 2. m |
Capillary | SE-30 | 145. | 1443. | Burkhard, Vais, et al., 1969 | N2; Column length: 50. m; Column diameter: 0.27 mm |
Capillary | SE-30 | 160. | 1463. | Burkhard, Vais, et al., 1969 | N2; Column length: 50. m; Column diameter: 0.27 mm |
Capillary | SE-30 | 175. | 1476. | Burkhard, Vais, et al., 1969 | N2; Column length: 50. m; Column diameter: 0.27 mm |
Capillary | SE-30 | 190. | 1491. | Burkhard, Vais, et al., 1969 | N2; Column length: 50. m; Column diameter: 0.27 mm |

Normal alkane RI, non-polar column, isothermal

Column type | Active phase | Temperature (C) | I | Reference | Comment |
---|---|---|---|---|---|
Capillary | Adamantyl siloxane | 160. | 1462. | Konstantinova, Berezkin, et al., 2005 | 22. m/0.22 mm/0.20 μm, Nitrogen |
Capillary | Adamantyl siloxane | 160. | 1462. | Konstantinova, Berezkin, et al., 2005, 2 | Nitrogen; Column length: 22. m; Column diameter: 0.22 mm |

Normal alkane RI, non-polar column, custom temperature program

Column type | Active phase | I | Reference | Comment |
---|---|---|---|---|
Capillary | Polydimethyl siloxane | 1443. | Bayat and Abad, 2011 | Program: not specified |
Capillary | Polydimethyl siloxane | 1443. | Bayat and Abad M.F.Y., 2011 | Program: not specified |

Gas phase ion energetics data

Data evaluated as indicated in comments:
HL - Edward P. Hunter and Sharon G. Lias

Data compiled as indicated in comments:
LLK - Sharon G. Lias, Rhoda D. Levin, and Sherif A. Kafafi
LBLHLM - Sharon G. Lias, John E. Bartmess, Joel F. Liebman, John L. Holmes, Rhoda D. Levin, and W. Gary Mallard

Quantity Value Units Method Reference Comment
Proton affinity (review)864.9kJ/molN/AHunter and Lias, 1998HL
Quantity Value Units Method Reference Comment
Gas basicity833.1kJ/molN/AHunter and Lias, 1998HL

Ionization energy determinations

IE (eV) Method Reference Comment
8.82 ± 0.05PEMiller, Koch, et al., 1973LLK

Appearance energy determinations

Ion AE (eV) Other Products MethodReferenceComment
C10H15+9.5 ± 0.2COCH3PIZauer and Takhistov, 1986LBLHLM

References

Abboud, Jimenez, et al., 1992
Abboud, J.-L.; Jimenez, P.; Roux, M.V.; Turrion, C.; Lopez-Mardingo, C.; Sanz, G.,
Structural effects on the thermochemical properties of carbonyl compounds. II. Enthalpies of combustion, vapour pressures and enthalpies of sublimation, and standard enthalpies of formation in the gaseous phase, of 1-adamantyl methyl ketone and of 1,1'-diadamantyl ketone,
J. Chem. Thermodyn., 1992, 24, 217-223. [all data]
Arutyunov, Kudryashov, et al., 2004
Arutyunov, Y.I.; Kudryashov, S.Y.; Onuchak, L.A.,
Analysis of Mixtures Containing Unknown Components by Gas Chromatography: Determination of Molecular Mass,
J. Anal. Chem. USSR (Engl. Transl.), 2004, 59, 4, 358-365. [all data]
Burkhard, Vais, et al., 1969
Burkhard, J.; Vais, J.; Vodicka, L.; Landa, S.,
Adamantane and its derivatives. XVI. The gas chromatographic characterization of adamantane derivatives,
J. Chromatogr., 1969, 42, 207-218, https://doi.org/10.1016/S0021-9673(01)80617-8
. [all data]
Konstantinova, Berezkin, et al., 2005
Konstantinova, K.K.; Berezkin, V.G.; Kurbatova, S.V.; Finkel'shtein, E.E.,
Relationship between physicochemical properties and chromatographic retention of some adamantane derivatives,
Russ. J. Appl. Chem. (Engl. Transl.), 2005, 78, 9, 1498-1502, https://doi.org/10.1007/s11167-005-0546-y
. [all data]
Konstantinova, Berezkin, et al., 2005, 2
Konstantinova, K.K.; Berezkin, V.G.; Kurbatova, S.V.; Finkel'stein, E.E.,
Relationship between Physicochemical Properties and Chromatographic Retention of Some Adamantane Derivatives,
Rus. J. Applied Chem., 2005, 78, 9, 1522-1526, https://doi.org/10.1007/s11167-005-0546-y
. [all data]
Bayat and Abad, 2011
Bayat, Z.; Abad, M.F.Y.,
Quantitative structure-property relationship (QSPR) study of Kovats retention indices of some of adamantane derivatives by the genetic algorithm amd nultiply linear regression (GA-MLR) method,
Petroleum Coal, 2011, 53, 2, 132-140. [all data]
Bayat and Abad M.F.Y., 2011
Bayat, Z.; Abad M.F.Y.,
Computational approaches to the prediction of the Kovats retention index (RI) for adamantane derivatives (AD) as a drug,
J. Chem. Pharm. Res., 2011, 3, 1, 48-55. [all data]