1-methyl-2-(1-methylethyl)cyclohexane

Phase change data

Data compiled by: Thermodynamics Research Center, NIST Boulder Laboratories, Chris Muzny director

Quantity Value Units Method Reference Comment
Tboil444.KN/ASabatier and Murat, 1913Uncertainty assigned by TRC = 4. K

In addition to the Thermodynamics Research Center (TRC) data available from this site, much more physical and chemical property data is available from the following TRC products:

References

Sabatier and Murat, 1913
Sabatier, P.; Murat, M., Preparation of Three Cymenes and Thre Menthanes, C. R. Hebd. Seances Acad. Sci., 1913, 156, 184. [all data]