t-Butyldiphenylmethanol
- Formula: C17H20O
- Molecular weight: 240.3401
- IUPAC Standard InChIKey: YOVSPPKJDDWJML-UHFFFAOYSA-N
- CAS Registry Number: 1657-60-9
- Chemical structure:
View 3d structure (requires JavaScript / HTML 5) - Other names: tert-Butyldiphenylmethanol

Phase change data

Data compiled by: Robert L. Brown and Stephen E. Stein
Reduced pressure boiling point
Tboil (K) | Pressure (bar) | Reference |
---|---|---|
383. | 0.000003 | Frinton Laboratories Inc., 1986 |

References

Frinton Laboratories Inc., 1986
Frinton Laboratories Inc.,
Catalog Number 11, Frinton Laboratories Inc., Vineland, NJ, 1986, 99. [all data]