Propanenitrile, 3,3'-oxybis-
- Formula: C6H8N2O
- Molecular weight: 124.1405
- IUPAC Standard InChIKey: BCGCCTGNWPKXJL-UHFFFAOYSA-N
- CAS Registry Number: 1656-48-0
- Chemical structure:
View 3d structure (requires JavaScript / HTML 5) - Other names: Propionitrile, 3,3'-oxydi-; β,β'-Bis(cyanoethyl) ether; β,β'-Dicyanodiethyl ether; β,β'-Oxydipropionitrile; Bis(2-cyanoethyl) ether; 3,3'-Oxydipropionitrile; Bis(cyanoethyl)ether; 2-Cyanoethyl ether; β, β-oxydipropionitrile; 2,2'-Dicyanodiethyl ether; di(2-Cyanoethyl)ether; 3,3-Oxydipropionitrile; Ether, bis(2-cyanoethyl); 2,2'-Oxydiethankarbonitril; Bis(β-Cyanoethyl) ether; O(CH2CH2CN)2; NSC 7769; 3,3'-oxydipropiononitrile

Phase change data

Data compiled as indicated in comments:
BS - Robert L. Brown and Stephen E. Stein
TRC - Thermodynamics Research Center, NIST Boulder Laboratories, Chris Muzny director
Quantity | Value | Units | Method | Reference | Comment |
---|---|---|---|---|---|
Tfus | 246.77 | K | N/A | Witschonke, 1954 | Uncertainty assigned by TRC = 0.3 K; TRC |
Tfus | 246.85 | K | N/A | Witschonke, 1954 | Uncertainty assigned by TRC = 0.2 K; TRC |
Reduced pressure boiling point
Tboil (K) | Pressure (bar) | Reference | Comment |
---|---|---|---|
384.2 | 0.0007 | Weast and Grasselli, 1989 | BS |
459. to 461. | 0.021 | Frinton Laboratories Inc., 1986 | BS |

Gas phase ion energetics data

Data evaluated by: Edward P. Hunter and Sharon G. Lias
Quantity | Value | Units | Method | Reference | Comment |
---|---|---|---|---|---|
Proton affinity (review) | 813.8 | kJ/mol | N/A | Hunter and Lias, 1998 | |
Quantity | Value | Units | Method | Reference | Comment |
Gas basicity | 786.4 | kJ/mol | N/A | Hunter and Lias, 1998 |

References

Witschonke, 1954
Witschonke, C.R.,
Freezing point and purity data for some organic compounds,
Anal. Chem., 1954, 26, 562-4. [all data]
Weast and Grasselli, 1989
CRC Handbook of Data on Organic Compounds, 2nd Editon, Weast,R.C and Grasselli, J.G., ed(s)., CRC Press, Inc., Boca Raton, FL, 1989, 1. [all data]
Frinton Laboratories Inc., 1986
Frinton Laboratories Inc.,
Catalog Number 11, Frinton Laboratories Inc., Vineland, NJ, 1986, 99. [all data]
Hunter and Lias, 1998
Hunter, E.P.; Lias, S.G.,
Evaluated Gas Phase Basicities and Proton Affinities of Molecules: An Update,
J. Phys. Chem. Ref. Data, 1998, 27, 3, 413-656, https://doi.org/10.1063/1.556018
. [all data]