Tungsten ion (1+)

Ion clustering data

Data compiled by: Robert C. Dunbar

Clustering reactions

Tungsten ion (1+) + Pyrrole = (Tungsten ion (1+) • Pyrrole)

By formula: W+ + C4H5N = (W+ • C4H5N)

Quantity Value Units Method Reference Comment
Δr>210.kJ/molRAKGapeev and Yang, 2000

Gas phase thermochemistry data

Quantity Value Units Method Reference Comment
gas,1 bar180.01J/mol*KReviewChase, 1998Data last reviewed in March, 1984

References

Gapeev and Yang, 2000
Gapeev, A.; Yang, C.-N., Binding Energies of Gas-Phase Ions with Pyrrole. Experimental and Quantum Chemical Results, J. Phys. Chem. A, 2000, 104, 14, 3246, https://doi.org/10.1021/jp992627d . [all data]