cis-Bicyclo[4.1.0]hept-3-ene
- Formula: C7H10
- Molecular weight: 94.1543
- IUPAC Standard InChIKey: JBFDZEJAJZJORO-KNVOCYPGSA-N
- CAS Registry Number: 16554-83-9
- Chemical structure:
View 3d structure (requires JavaScript / HTML 5) - Stereoisomers:

Gas phase thermochemistry data

Data compiled by: Hussein Y. Afeefy, Joel F. Liebman, and Stephen E. Stein
Quantity | Value | Units | Method | Reference | Comment |
---|---|---|---|---|---|
ΔfH°gas | 120. | kJ/mol | Ciso | Roth, Adamczak, et al., 1991 |

Phase change data

Data compiled by: William E. Acree, Jr., James S. Chickos
Quantity | Value | Units | Method | Reference | Comment |
---|---|---|---|---|---|
ΔvapH° | 38.4 ± 0.6 | kJ/mol | EB | Varushchenko, Druzhimina, et al., 1974 |
Enthalpy of vaporization
ΔvapH (kJ/mol) | Temperature (K) | Method | Reference | Comment |
---|---|---|---|---|
36.7 | 348. | A | Stephenson and Malanowski, 1987 | Based on data from 333. to 384. K. |

References

Roth, Adamczak, et al., 1991
Roth, W.R.; Adamczak, O.; Breuckmann, R.; Lennartz, H.-W.; Boese, R.,
Die Berechnung von Resonanzenergien; das MM2ERW-Kraftfeld,
Chem. Ber., 1991, 124, 2499-2521. [all data]
Varushchenko, Druzhimina, et al., 1974
Varushchenko, R.M.; Druzhimina, A.I.; Kovner, O.Y.; Mil'vitskaya, E.M.; Bobyleva, A.A.; Belikova, N.A.; Gal'chenko, G.L.,
Russ. J. Phys. Chem., 1974, 48, 1121. [all data]
Stephenson and Malanowski, 1987
Stephenson, Richard M.; Malanowski, Stanislaw,
Handbook of the Thermodynamics of Organic Compounds, 1987, https://doi.org/10.1007/978-94-009-3173-2
. [all data]