Azulene,5-methyl-

Kovats' RI, non-polar column, isothermal

Data compiled by: NIST Mass Spectrometry Data Center, William E. Wallace, director

Column type Capillary
Active phase OV-1
Column length (m) 50.
Carrier gas
Substrate
Column diameter (mm) 0.23
Phase thickness (μm)
Temperature (C) 130.
I 1400.
ReferenceEngewald, Wennrich, et al., 1979
Comment MSDC-RI

Gas phase ion energetics data

Data compiled as indicated in comments:
LLK - Sharon G. Lias, Rhoda D. Levin, and Sherif A. Kafafi

Ionization energy determinations

IE (eV) Method Reference Comment
7.30 ± 0.03PEHeilbronner, Hoshi, et al., 1976Vertical value; LLK

References

Engewald, Wennrich, et al., 1979
Engewald, W.; Wennrich, L.; Ritter, E., Molekülstruktur und Retentionsverhalten. XII. Zur Retention von Alkylnaphthalinen Bei der Gasverteilungs- und Gas-Adsorptions-Chromatographie, J. Chromatogr., 1979, 174, 2, 315-323, https://doi.org/10.1016/S0021-9673(00)86005-7 . [all data]