Cyclohexanol, 2-chloro-, cis
- Formula: C6H11ClO
- Molecular weight: 134.604
- IUPAC Standard InChIKey: NYEWDMNOXFGGDX-NTSWFWBYSA-N
- CAS Registry Number: 16536-58-6
- Chemical structure:
View 3d structure (requires JavaScript / HTML 5) - Stereoisomers:
- Other names: 2-Chlorocyclohexanol, cis; 2-Chlorocyclohexanol; (+/-)-cis-2-Chlorocyclohexanol; (Z)-2-Chlorocyclohexanol

Phase change data

Data compiled by: Thermodynamics Research Center, NIST Boulder Laboratories, Chris Muzny director
Quantity | Value | Units | Method | Reference | Comment |
---|---|---|---|---|---|
Tfus | 310. | K | N/A | Stevens and Grummitt, 1952 | Uncertainty assigned by TRC = 3. K |

References

Stevens and Grummitt, 1952
Stevens, H.C.; Grummitt, O.,
The Stereochemitry of te Reactions of cis- and trans-2-Chlorocyclohexanol with Thionyl Chloride,
J. Am. Chem. Soc., 1952, 74, 4876-9. [all data]