1-Heptanol, 6-methyl-
- Formula: C8H18O
- Molecular weight: 130.2279
- IUPAC Standard InChIKey: BWDBEAQIHAEVLV-UHFFFAOYSA-N
- CAS Registry Number: 1653-40-3
- Chemical structure:
View 3d structure (requires JavaScript / HTML 5) - Other names: 6-Methyl-1-heptanol; 6-Methylheptanol

Phase change data

Data compiled as indicated in comments:
TRC - Thermodynamics Research Center, NIST Boulder Laboratories, Chris Muzny director
AC - William E. Acree, Jr., James S. Chickos
Quantity | Value | Units | Method | Reference | Comment |
---|---|---|---|---|---|
Tboil | 460.15 | K | N/A | Milburn and Truter, 1954 | Uncertainty assigned by TRC = 3. K; TRC |
Tboil | 460.75 | K | N/A | Dorough, Glass, et al., 1941 | Uncertainty assigned by TRC = 0.5 K; TRC |
Enthalpy of vaporization
ΔvapH (kJ/mol) | Temperature (K) | Method | Reference | Comment |
---|---|---|---|---|
61.0 | 383. | A | Stephenson and Malanowski, 1987 | Based on data from 368. to 610. K. See also Wilhoit and Zwolinski, 1973.; AC |

References

Milburn and Truter, 1954
Milburn, A.H.; Truter, E.V.,
Components of Wool Wax II. Synthesis of the Acids and Alcohols of the Iso- and the (+)-Anteiso-Series,
J. Chem. Soc., 1954, 1954, 3344. [all data]
Dorough, Glass, et al., 1941
Dorough, G.L.; Glass, H.B.; Gresham, T.L.; Malone, G.B.; Reid, E.E.,
Structure-property relationships in some isomeric octanols,
J. Am. Chem. Soc., 1941, 63, 3100. [all data]
Stephenson and Malanowski, 1987
Stephenson, Richard M.; Malanowski, Stanislaw,
Handbook of the Thermodynamics of Organic Compounds, 1987, https://doi.org/10.1007/978-94-009-3173-2
. [all data]
Wilhoit and Zwolinski, 1973
Wilhoit, R.C.; Zwolinski, B.J.,
Physical and thermodynamic properties of aliphatic alcohols,
J. Phys. Chem. Ref. Data Suppl., 1973, 1, 2, 1. [all data]