4-methyl-2-chloro-1-pentene
- Formula: C6H11Cl
- Molecular weight: 118.605
- IUPAC Standard InChIKey: OBKIECKGIDAPGH-UHFFFAOYSA-N
- CAS Registry Number: 16530-66-8
- Chemical structure:
View 3d structure (requires JavaScript / HTML 5) - Permanent link for this species. Use this link for bookmarking this species for future reference.

Phase change data

Data compiled by: Thermodynamics Research Center, NIST Boulder Laboratories, Chris Muzny director
Quantity | Value | Units | Method | Reference | Comment |
---|---|---|---|---|---|
Tboil | 375.65 | K | N/A | Pomerantz, Fookson, et al., 1954 | Uncertainty assigned by TRC = 2. K |

References

Pomerantz, Fookson, et al., 1954
Pomerantz, P.; Fookson, A.; Mears, T.W.; Rothberg, S.; Howard, F.L.,
Synthesis and Physical Properties of Several Acetylenic Hydrocarbons,
J. Res. Natl. Bur. Stand. (U. S.), 1954, 52, 51. [all data]