3-Pentenenitrile, (3E)-
- Formula: C5H7N
- Molecular weight: 81.1158
- IUPAC Standard InChIKey: UVKXJAUUKPDDNW-NSCUHMNNSA-N
- CAS Registry Number: 16529-66-1
- Chemical structure:
View 3d structure (requires JavaScript / HTML 5) - Stereoisomers:
- Other names: (E)-3-Pentenenitrile

Gas phase thermochemistry data

Data compiled by: Hussein Y. Afeefy, Joel F. Liebman, and Stephen E. Stein
Quantity | Value | Units | Method | Reference | Comment |
---|---|---|---|---|---|
ΔfH°gas | 126. ± 1. | kJ/mol | Ccb | Konicek, Prochzka, et al., 1969 |

Condensed phase thermochemistry data

Data compiled by: Hussein Y. Afeefy, Joel F. Liebman, and Stephen E. Stein
Quantity | Value | Units | Method | Reference | Comment |
---|---|---|---|---|---|
ΔfH°liquid | 81. ± 1. | kJ/mol | Ccb | Konicek, Prochzka, et al., 1969 | |
Quantity | Value | Units | Method | Reference | Comment |
ΔcH°liquid | -3048.8 ± 1.2 | kJ/mol | Ccb | Konicek, Prochzka, et al., 1969 |

Phase change data

Data compiled as indicated in comments:
BS - Robert L. Brown and Stephen E. Stein
ALS - Hussein Y. Afeefy, Joel F. Liebman, and Stephen E. Stein
DRB - Donald R. Burgess, Jr.
AC - William E. Acree, Jr., James S. Chickos
Quantity | Value | Units | Method | Reference | Comment |
---|---|---|---|---|---|
Tboil | 418.7 | K | N/A | Aldrich Chemical Company Inc., 1990 | BS |
Quantity | Value | Units | Method | Reference | Comment |
ΔvapH° | 44.8 ± 0.2 | kJ/mol | V | Konicek, Prochzka, et al., 1969 | ALS |
ΔvapH° | 45.0 | kJ/mol | N/A | Konicek, Prochzka, et al., 1969 | DRB |
ΔvapH° | 44.8 | kJ/mol | N/A | Konicek, Prochzka, et al., 1969 | AC |

References

Konicek, Prochzka, et al., 1969
Konicek, J.; Prochzka, M.; Krestanov, V.; Smisek, M.,
Thermochemie der nitrile I. Über die bildungswärmen aliphatischer nitrile,
Collect. Czech. Chem. Commun., 1969, 34, 2249-2257. [all data]
Aldrich Chemical Company Inc., 1990
Aldrich Chemical Company Inc.,
Catalog Handbook of Fine Chemicals, Aldrich Chemical Company, Inc., Milwaukee WI, 1990, 1. [all data]