cis-Bicyclo[5.1.0]octane
- Formula: C8H14
- Molecular weight: 110.1968
- IUPAC Standard InChIKey: AKHMHYGTZRJYBS-OCAPTIKFSA-N
- CAS Registry Number: 16526-90-2
- Chemical structure:
View 3d structure (requires JavaScript / HTML 5) - Stereoisomers:

Gas phase thermochemistry data

Data compiled as indicated in comments:
ALS - Hussein Y. Afeefy, Joel F. Liebman, and Stephen E. Stein
GT - Glushko Thermocenter, Russian Academy of Sciences, Moscow
Quantity | Value | Units | Method | Reference | Comment |
---|---|---|---|---|---|
ΔfH°gas | -6.1 ± 2.4 | kJ/mol | Ccb | Luk'yanova, Timofeeva, et al., 1991 | ALS |
Constant pressure heat capacity of gas
Cp,gas (J/mol*K) | Temperature (K) | Reference | Comment |
---|---|---|---|
139.45 | 298.15 | Chang S., 1970 | These values were calculated by a method of force field; their uncertainties may exceed 5-10 J/mol*K.; GT |
191.33 | 400. | ||
237.40 | 500. |

Condensed phase thermochemistry data

Data compiled by: Hussein Y. Afeefy, Joel F. Liebman, and Stephen E. Stein
Quantity | Value | Units | Method | Reference | Comment |
---|---|---|---|---|---|
ΔfH°liquid | -49.6 ± 2.3 | kJ/mol | Ccb | Luk'yanova, Timofeeva, et al., 1991 | |
Quantity | Value | Units | Method | Reference | Comment |
ΔcH°liquid | -5099.3 ± 2.3 | kJ/mol | Ccb | Luk'yanova, Timofeeva, et al., 1991 | Corresponding ΔfHºliquid = -49.6 kJ/mol (simple calculation by NIST; no Washburn corrections) |

Phase change data

Data compiled as indicated in comments:
DRB - Donald R. Burgess, Jr.
AC - William E. Acree, Jr., James S. Chickos
Quantity | Value | Units | Method | Reference | Comment |
---|---|---|---|---|---|
ΔvapH° | 43.5 | kJ/mol | N/A | Luk'yanova, Timofeeva, et al., 1991 | DRB |
Enthalpy of vaporization
ΔvapH (kJ/mol) | Temperature (K) | Method | Reference | Comment |
---|---|---|---|---|
43.6 ± 0.8 | 309. | A | Stephenson and Malanowski, 1987 | Based on data from 297. to 322. K. See also Chang, McNally, et al., 1970.; AC |

Kovats' RI, non-polar column, isothermal

Column type | Active phase | Temperature (C) | I | Reference | Comment |
---|---|---|---|---|---|
Capillary | Squalane | 90. | 888. | Engewald, Epsch, et al., 1976 | N2; Column length: 100. m; Column diameter: 0.23 mm |

References

Luk'yanova, Timofeeva, et al., 1991
Luk'yanova, V.A.; Timofeeva, L.P.; Kozina, M.P.; Kazimirchik, I.V.; Kotel'nikova, T.A.,
Enthalpies of formation of certain polycyclic hydrocarbons,
Russ. J. Phys. Chem. (Engl. Transl.), 1991, 65, 436-439. [all data]
Chang S., 1970
Chang S.,
The heats of combustion and strain energies of bicyclo[n.m.0]alkanes,
J. Am. Chem. Soc., 1970, 92, 3109-3118. [all data]
Stephenson and Malanowski, 1987
Stephenson, Richard M.; Malanowski, Stanislaw,
Handbook of the Thermodynamics of Organic Compounds, 1987, https://doi.org/10.1007/978-94-009-3173-2
. [all data]
Chang, McNally, et al., 1970
Chang, Sho-ju.; McNally, D.; Shary-Tehrany, S.; Hickey, S.M.J.; Boyd, R.H.,
The heats of combustion and strain energies of bicylo[n.m.O]alkanes,
J. Am. Chem. Soc., 1970, 92, 3109-3118. [all data]
Engewald, Epsch, et al., 1976
Engewald, W.; Epsch, K.; Welsch, Th.; Graefe, J.,
Molekülstruktur und Retentionsverhalten. VI. Retentionsverhalten von bicycle[n.m.0]alkanen bei der gas-adsorptions- und gas-verteilungs-chromatographie,
J. Chromatogr., 1976, 119, 119-128, https://doi.org/10.1016/S0021-9673(00)86776-X
. [all data]