3-Butynylbenzene
- Formula: C10H10
- Molecular weight: 130.1864
- IUPAC Standard InChIKey: QDEOKXOYHYUKMS-UHFFFAOYSA-N
- CAS Registry Number: 16520-62-0
- Chemical structure:
View 3d structure (requires JavaScript / HTML 5) - Other names: Benzene, 3-butynyl-; 4-Phenyl-1-butyne

Condensed phase thermochemistry data

Data compiled as indicated in comments:
DRB - Donald R. Burgess, Jr.
ALS - Hussein Y. Afeefy, Joel F. Liebman, and Stephen E. Stein
Quantity | Value | Units | Method | Reference | Comment |
---|---|---|---|---|---|
ΔfH°liquid | 248.6 ± 5.0 | kJ/mol | Ccb | N/A | recalculated with modern CO2,H2O thermo; estimated uncertainty (NOTE all values in source also have wrong sign); DRB |
ΔfH°liquid | -212.3 | kJ/mol | Ccb | Moureu and Andre, 1914 | ALS |
Quantity | Value | Units | Method | Reference | Comment |
ΔcH°liquid | -5612.8 | kJ/mol | Ccb | Moureu and Andre, 1914 | Corresponding ΔfHºliquid = 249. kJ/mol (simple calculation by NIST; no Washburn corrections); ALS |

Phase change data

Data compiled as indicated in comments:
BS - Robert L. Brown and Stephen E. Stein
TRC - Thermodynamics Research Center, NIST Boulder Laboratories, Chris Muzny director
Quantity | Value | Units | Method | Reference | Comment |
---|---|---|---|---|---|
Tboil | 463. | K | N/A | Farchan Laboratories, 1990 | BS |
Tboil | 450.65 | K | N/A | Moureu and Andre, 1914, 2 | Uncertainty assigned by TRC = 3. K; TRC |
Reduced pressure boiling point
Tboil (K) | Pressure (bar) | Reference | Comment |
---|---|---|---|
328. | 0.005 | Farchan Laboratories, 1990 | BS |
356.2 | 0.020 | Weast and Grasselli, 1989 | BS |

Kovats' RI, non-polar column, isothermal

Column type | Active phase | Temperature (C) | I | Reference | Comment |
---|---|---|---|---|---|
Capillary | SE-30 | 130. | 1064. | Bredael, 1982 | Column length: 100. m; Column diameter: 0.5 mm |
Capillary | SE-30 | 80. | 1053. | Bredael, 1982 | Column length: 100. m; Column diameter: 0.5 mm |

Normal alkane RI, non-polar column, custom temperature program

Column type | Active phase | I | Reference | Comment |
---|---|---|---|---|
Capillary | OV-1, SE-30, Methyl silicone, SP-2100, OV-101, DB-1, etc. | 1053. | Waggott and Davies, 1984 | Hydrogen; Column length: 50. m; Column diameter: 0.32 mm; Program: not specified |

Gas phase ion energetics data

Data compiled as indicated in comments:
LLK - Sharon G. Lias, Rhoda D. Levin, and Sherif A. Kafafi

Ionization energy determinations

IE (eV) Method Reference Comment
8.5EIKoppel, Schwarz, et al., 1974LLK

References

Moureu and Andre, 1914
Moureu, C.; Andre, E.,
Thermochimie des composes acetyleniques,
Ann. Chim. Phys., 1914, 1, 113-145. [all data]
Farchan Laboratories, 1990
Farchan Laboratories,
Research Chemicals Catalog, Farchan Laboratories, Gainesville, FL, 1990, 91. [all data]
Moureu and Andre, 1914, 2
Moureu, C.; Andre, E.,
Thermochemistry of Acetylenic Compounds,
Ann. Chim. (Paris), 1914, 1, 113. [all data]
Weast and Grasselli, 1989
CRC Handbook of Data on Organic Compounds, 2nd Editon, Weast,R.C and Grasselli, J.G., ed(s)., CRC Press, Inc., Boca Raton, FL, 1989, 1. [all data]