Triphenylcyclopropene
- Formula: C21H16
- Molecular weight: 268.3517
- IUPAC Standard InChIKey: UFTDGVXRVMJEDI-UHFFFAOYSA-N
- CAS Registry Number: 16510-49-9
- Chemical structure:
View 3d structure (requires JavaScript / HTML 5) - Species with the same structure:
- Other names: 1,2,3-Triphenylcyclopropene; Benzene, 1,1',1''-(1-cyclopropene-1,2,3-triyl)tris-; Cyclopropene, 1,2,3-triphenyl-; 1,1',1''-(1-cyclopropene-1,2,3-triyl)trisbenzene

Reaction thermochemistry data

Data compiled by: John E. Bartmess
Individual Reactions
C21H15- + =
By formula: C21H15- + H+ = C21H16
Quantity | Value | Units | Method | Reference | Comment |
---|---|---|---|---|---|
ΔrH° | 1613. ± 21. | kJ/mol | G+TS | Bartmess, Kester, et al., 1986 | gas phase; Between H2O, MeOH |
Quantity | Value | Units | Method | Reference | Comment |
ΔrG° | 1577. ± 21. | kJ/mol | IMRB | Bartmess, Kester, et al., 1986 | gas phase; Between H2O, MeOH |

Gas phase ion energetics data

Data compiled by: John E. Bartmess
De-protonation reactions
C21H15- + =
By formula: C21H15- + H+ = C21H16
Quantity | Value | Units | Method | Reference | Comment |
---|---|---|---|---|---|
ΔrH° | 1613. ± 21. | kJ/mol | G+TS | Bartmess, Kester, et al., 1986 | gas phase; Between H2O, MeOH |
Quantity | Value | Units | Method | Reference | Comment |
ΔrG° | 1577. ± 21. | kJ/mol | IMRB | Bartmess, Kester, et al., 1986 | gas phase; Between H2O, MeOH |

References

Bartmess, Kester, et al., 1986
Bartmess, J.E.; Kester, J.; Borden, W.T.; Köser, H.G.,
Triphenylcyclopropenide Anion in the Gas Phase,
Tetrahed. Lett., 1986, 27, 49, 5931, https://doi.org/10.1016/S0040-4039(00)85365-4
. [all data]