(R*,R*)-(±)-2,3-dimethyl-2,3-diphenylbutanedinitrile

Phase change data

Data compiled by: Thermodynamics Research Center, NIST Boulder Laboratories, Chris Muzny director

Quantity Value Units Method Reference Comment
Tfus420.KN/APeterson, 1967Uncertainty assigned by TRC = 3. K

In addition to the Thermodynamics Research Center (TRC) data available from this site, much more physical and chemical property data is available from the following TRC products:

References

Peterson, 1967
Peterson, L.L., The meso-dl isomerization of 2,3-dimethyl-2,3-diphenylsuccinonitrile, J. Am. Chem. Soc., 1967, 89, 2677-2681. [all data]