Propanoic acid, 2,2-dimethyl, 1,1-dimethylethyl ester
- Formula: C9H18O2
- Molecular weight: 158.2380
- IUPAC Standard InChIKey: VXHFNALHLRWIIU-UHFFFAOYSA-N
- CAS Registry Number: 16474-43-4
- Chemical structure:
View 3d structure (requires JavaScript / HTML 5) - Other names: tert-butyl pivalate

Phase change data

Data compiled by: Thermodynamics Research Center, NIST Boulder Laboratories, Chris Muzny director
Quantity | Value | Units | Method | Reference | Comment |
---|---|---|---|---|---|
Tboil | 438.15 | K | N/A | Whitmore, 1938 | Uncertainty assigned by TRC = 2.5 K |

Kovats' RI, non-polar column, isothermal

Column type | Active phase | Temperature (C) | I | Reference | Comment |
---|---|---|---|---|---|
Packed | SE-30 | 100. | 841. | Chastrette, Heintz, et al., 1974 | N2, Chromosorb W AW (60-80 mesh); Column length: 3. m |

Kovats' RI, polar column, isothermal

Column type | Active phase | Temperature (C) | I | Reference | Comment |
---|---|---|---|---|---|
Packed | Carbowax 20M | 100. | 939. | Chastrette, Heintz, et al., 1974 | Chromosorb WAW (60-80 mesh); Column length: 3. m |

References

Whitmore, 1938
Whitmore, F.C.,
The Reducing Action of Grignard Reagents on Acyl Chlorides,
Recl. Trav. Chim. Pays-Bas, 1938, 57, 562. [all data]
Chastrette, Heintz, et al., 1974
Chastrette, M.; Heintz, M.; Druilhe, A.; Lefort, D.,
Analyse chromatographique d'esters aliphatiques saturés. Relations rétention-structure et prévision de la rétention,
Bull. Soc. Chim. Fr., 1974, 9/10,Pt.1, 1852-1856. [all data]