1,9-Decadiene
- Formula: C10H18
- Molecular weight: 138.2499
- IUPAC Standard InChIKey: NLDGJRWPPOSWLC-UHFFFAOYSA-N
- CAS Registry Number: 1647-16-1
- Chemical structure:
View 3d structure (requires JavaScript / HTML 5) - Other names: Decadiene-1,9

Phase change data

Data compiled as indicated in comments:
BS - Robert L. Brown and Stephen E. Stein
TRC - Thermodynamics Research Center, NIST Boulder Laboratories, Chris Muzny director
Quantity | Value | Units | Method | Reference | Comment |
---|---|---|---|---|---|
Tboil | 442.2 | K | N/A | Weast and Grasselli, 1989 | BS |
Tboil | 438.0 | K | N/A | Marvel and Garrison, 1959 | Uncertainty assigned by TRC = 1.5 K; TRC |
Tboil | 438. | K | N/A | Everet and Kon, 1950 | Uncertainty assigned by TRC = 2. K; TRC |

Kovats' RI, non-polar column, isothermal

Column type | Active phase | Temperature (C) | I | Reference | Comment |
---|---|---|---|---|---|
Capillary | Squalane | 70. | 964. | Soják, Král'ovicová, et al., 1984 | 195. m/0.25 mm/0.08 μm, H2 |
Packed | SE-30 | 175. | 966. | Casteignau and Villessot, 1968 | Column length: 3. m |

Kovats' RI, polar column, isothermal

Column type | Active phase | Temperature (C) | I | Reference | Comment |
---|---|---|---|---|---|
Packed | Carbowax 20M | 175. | 1160. | Casteignau and Villessot, 1968 | Column length: 3. m |

Normal alkane RI, non-polar column, temperature ramp

Column type | Active phase | I | Reference | Comment |
---|---|---|---|---|
Capillary | Petrocol DH | 978. | Supelco, 2012 | 100. m/0.25 mm/0.50 μm, Helium, 20. C @ 15. min, 15. K/min, 220. C @ 30. min |
Capillary | Ultra-ALLOY-5 | 983. | Tsuge, Ohtan, et al., 2011 | 30. m/0.25 mm/0.25 μm, 40. C @ 2. min, 20. K/min, 320. C @ 13. min |
Capillary | Petrocol DH | 978. | Sojak, Kubinec, et al., 2006 | 150. m/0.25 mm/1.0 μm, 1. K/min; Tstart: 40. C; Tend: 300. C |

References

Weast and Grasselli, 1989
CRC Handbook of Data on Organic Compounds, 2nd Editon, Weast,R.C and Grasselli, J.G., ed(s)., CRC Press, Inc., Boca Raton, FL, 1989, 1. [all data]
Marvel and Garrison, 1959
Marvel, C.S.; Garrison, W.E.,
Polymerization of Higher a.pha.-Olefins eith Metal ALkyl Coordination Catalysts,
J. Am. Chem. Soc., 1959, 81, 4737-44. [all data]
Everet and Kon, 1950
Everet, J.L.; Kon, G.A.R.,
J. Chem. Soc., 1950, 1950, 3131. [all data]
Soják, Král'ovicová, et al., 1984
Soják, L.; Král'ovicová, E.; Ostrovský, I.; Leclercq, P.A.,
Retention behaviour of conjegated and isolated n-alkadienes. Identification of n-nona- and n-decadiens by capillary gas chromatography using structure-retention correlations and mass spectrometry,
J. Chromatogr., 1984, 292, 1, 241-261, https://doi.org/10.1016/S0021-9673(01)96207-7
. [all data]
Casteignau and Villessot, 1968
Casteignau, G.; Villessot, D.,
Identification par chromatographie en phase gaseuse de composés difonctionnels insaturés. I. Synthèse et indices de rétention,
Bull. Soc. Chim. Fr., 1968, 9, 3893-3903. [all data]
Supelco, 2012
Supelco, CatalogNo. 24160-U,
Petrocol DH Columns. Catalog No. 24160-U, 2012, retrieved from http://www.sigmaaldrich.com/etc/medialib/docs/Supelco/Datasheet/1/w97949.Par.0001.File.tmp/w97949.pdf. [all data]
Tsuge, Ohtan, et al., 2011
Tsuge, S.; Ohtan, H.; Watanabe, C.,
Pyrolysis - GC/MS Data Book of Synthetic Polymers, Elsevier, 2011, 420. [all data]
Sojak, Kubinec, et al., 2006
Sojak, L.; Kubinec, R.; Jurdakova, H.; Hajekova, E.; Bajus, M.,
GC-MS of polyethylene and polypropylene thermal cracking produxts,
Petroleum Coal, 2006, 48, 1, 1-14. [all data]