4,4-Dimethyl-1-hexene
- Formula: C8H16
- Molecular weight: 112.2126
- IUPAC Standard InChIKey: SUJVAMIXNUAJEY-UHFFFAOYSA-N
- CAS Registry Number: 1647-08-1
- Chemical structure:
View 3d structure (requires JavaScript / HTML 5) - Other names: 1-Hexene, 4,4-dimethyl-; 4,4-Dimethylhex-1-ene

Phase change data

Data compiled by: William E. Acree, Jr., James S. Chickos
Quantity | Value | Units | Method | Reference | Comment |
---|---|---|---|---|---|
ΔvapH° | 31.0 | kJ/mol | N/A | Reid, 1972 |

References

Reid, 1972
Reid, Robert C.,
Handbook on vapor pressure and heats of vaporization of hydrocarbons and related compounds, R. C. Wilhort and B. J. Zwolinski, Texas A Research Foundation. College Station, Texas(1971). 329 pages.$10.00,
AIChE J., 1972, 18, 6, 1278-1278, https://doi.org/10.1002/aic.690180637
. [all data]