2-Acetylbenzofuran
- Formula: C10H8O2
- Molecular weight: 160.1693
- IUPAC Standard InChIKey: YUTFQTAITWWGFH-UHFFFAOYSA-N
- CAS Registry Number: 1646-26-0
- Chemical structure:
View 3d structure (requires JavaScript / HTML 5) - Other names: Ethanone, 1-(2-benzofuranyl)-; Benzofuran-2-yl methyl ketone; 2-Acetylbenzo[b]furan; Ketone, 2-benzofuranyl methyl; 2-Acetylcoumarone; 2-Benzofuranyl methyl ketone; Benzo(b)furan-2-yl methyl ketone; 1-(2-Benzofuranyl)ethanone; NSC 23974; NSC 28904

Phase change data

Data compiled by: Robert L. Brown and Stephen E. Stein
Reduced pressure boiling point
Tboil (K) | Pressure (atm) | Reference |
---|---|---|
384.7 | 0.004 | Aldrich Chemical Company Inc., 1990 |

References

Aldrich Chemical Company Inc., 1990
Aldrich Chemical Company Inc.,
Catalog Handbook of Fine Chemicals, Aldrich Chemical Company, Inc., Milwaukee WI, 1990, 1. [all data]