4-(Chloromethyl)benzoic acid
- Formula: C8H7ClO2
- Molecular weight: 170.593
- IUPAC Standard InChIKey: OITNBJHJJGMFBN-UHFFFAOYSA-N
- CAS Registry Number: 1642-81-5
- Chemical structure:
View 3d structure (requires JavaScript / HTML 5) - Other names: α-Chloro-p-toluylic acid; Benzoic acid, 4-(chloromethyl)-

Gas phase ion energetics data

Data compiled by: John E. Bartmess
De-protonation reactions
C8H6ClO2- + =
By formula: C8H6ClO2- + H+ = C8H7ClO2
Quantity | Value | Units | Method | Reference | Comment |
---|---|---|---|---|---|
ΔrH° | 1407. ± 8.8 | kJ/mol | G+TS | Decouzon, Exner, et al., 1994 | gas phase |
Quantity | Value | Units | Method | Reference | Comment |
ΔrG° | 1378. ± 8.4 | kJ/mol | IMRE | Decouzon, Exner, et al., 1994 | gas phase |

Reaction thermochemistry data

Data compiled by: John E. Bartmess

Individual Reactions

C8H6ClO2- + Hydrogen cation = 4-(Chloromethyl)benzoic acid

By formula: C8H6ClO2- + H+ = C8H7ClO2

Quantity Value Units Method Reference Comment
Δr336.3 ± 2.1kcal/molG+TSDecouzon, Exner, et al., 1994gas phase
Quantity Value Units Method Reference Comment
Δr329.3 ± 2.0kcal/molIMREDecouzon, Exner, et al., 1994gas phase

References

Decouzon, Exner, et al., 1994
Decouzon, M.; Exner, O.; Gal, J.F.; Maria, P.C.,
The Meta versus Para substituent effect in the gas phase: Separation of inductive and resonance components,
J. Phys. Org. Chem., 1994, 7, 11, 615, https://doi.org/10.1002/poc.610071105
. [all data]