Cyclohexanol, 5-methyl-2-(1-methylethyl)-, acetate
- Formula: C12H22O2
- Molecular weight: 198.3019
- IUPAC Standard InChIKey: XHXUANMFYXWVNG-UHFFFAOYSA-N
- CAS Registry Number: 16409-45-3
- Chemical structure:
View 3d structure (requires JavaScript / HTML 5) - Species with the same structure:
- Stereoisomers:
- Other names: Menthol, acetate; Menthyl acetate; Acetic acid, p-menth-3-yl ester, dl-; dl-Menthyl acetate; Menthyl acetate racemic; l-Menthol acetate; (d) menthyl acetate

Phase change data

Data compiled by: William E. Acree, Jr., James S. Chickos
Enthalpy of vaporization
ΔvapH (kcal/mol) | Temperature (K) | Method | Reference | Comment |
---|---|---|---|---|
13.2 | 345. | A | Stephenson and Malanowski, 1987 | Based on data from 330. to 500. K. See also Stull, 1947. |

Normal alkane RI, non-polar column, temperature ramp

Column type | Active phase | I | Reference | Comment |
---|---|---|---|---|
Capillary | HP-5 | 1294. | Duarte, Figueira, et al., 2005 | 25. m/0.2 mm/0.33 μm, He, 3. K/min, 240. C @ 7. min; Tstart: 60. C |

References

Stephenson and Malanowski, 1987
Stephenson, Richard M.; Malanowski, Stanislaw,
Handbook of the Thermodynamics of Organic Compounds, 1987, https://doi.org/10.1007/978-94-009-3173-2
. [all data]
Stull, 1947
Stull, Daniel R.,
Vapor Pressure of Pure Substances. Organic and Inorganic Compounds,
Ind. Eng. Chem., 1947, 39, 4, 517-540, https://doi.org/10.1021/ie50448a022
. [all data]
Duarte, Figueira, et al., 2005
Duarte, M.C.T.; Figueira, G.M.; Sartoratto, A.; Rehder, V.L.G.; Delarmelina, C.,
Anti-Candida activity of Brazilian medicinal plants,
J. Ethnopharmacol., 2005, 97, 2, 305-311, https://doi.org/10.1016/j.jep.2004.11.016
. [all data]