3H-Indole, 2,3,3-trimethyl-
- Formula: C11H13N
- Molecular weight: 159.2276
- IUPAC Standard InChIKey: FLHJIAFUWHPJRT-UHFFFAOYSA-N
- CAS Registry Number: 1640-39-7
- Chemical structure:
View 3d structure (requires JavaScript / HTML 5) - Other names: 2,3,3-Trimethyl-3H-indole; 2,3,3-Trimethylindolenine

Phase change data

Data compiled by: Robert L. Brown and Stephen E. Stein
Quantity | Value | Units | Method | Reference | Comment |
---|---|---|---|---|---|
Tboil | 501. to 502. | K | N/A | Frinton Laboratories Inc., 1986 |
Reduced pressure boiling point
Tboil (K) | Pressure (bar) | Reference |
---|---|---|
501.7 | 0.992 | Aldrich Chemical Company Inc., 1990 |

References

Frinton Laboratories Inc., 1986
Frinton Laboratories Inc.,
Catalog Number 11, Frinton Laboratories Inc., Vineland, NJ, 1986, 99. [all data]
Aldrich Chemical Company Inc., 1990
Aldrich Chemical Company Inc.,
Catalog Handbook of Fine Chemicals, Aldrich Chemical Company, Inc., Milwaukee WI, 1990, 1. [all data]