2-Butanethiol, 2,3-dimethyl-
- Formula: C6H14S
- Molecular weight: 118.240
- IUPAC Standard InChIKey: CRJLQECEGNIMNG-UHFFFAOYSA-N
- CAS Registry Number: 1639-01-6
- Chemical structure:
View 3d structure (requires JavaScript / HTML 5) - Other names: 2,3-Dimethyl-2-butanethiol; 2,3-Dimethylbutan-2-thiol

Gas phase thermochemistry data

Data compiled by: Hussein Y. Afeefy, Joel F. Liebman, and Stephen E. Stein
Quantity | Value | Units | Method | Reference | Comment |
---|---|---|---|---|---|
ΔfH°gas | -147.9 ± 1.0 | kJ/mol | Ccr | Good, 1972 | Reanalyzed by Pedley, Naylor, et al., 1986, Original value = -147.4 ± 0.84 kJ/mol |

Condensed phase thermochemistry data

Data compiled by: Hussein Y. Afeefy, Joel F. Liebman, and Stephen E. Stein
Quantity | Value | Units | Method | Reference | Comment |
---|---|---|---|---|---|
ΔfH°liquid | -187.2 ± 1.0 | kJ/mol | Ccr | Good, 1972 | Reanalyzed by Pedley, Naylor, et al., 1986, Original value = -186.6 ± 0.79 kJ/mol |
Quantity | Value | Units | Method | Reference | Comment |
ΔcH°liquid | -4777.04 ± 0.67 | kJ/mol | Ccr | Good, 1972 |

Phase change data

Data compiled as indicated in comments:
ALS - Hussein Y. Afeefy, Joel F. Liebman, and Stephen E. Stein
DRB - Donald R. Burgess, Jr.
AC - William E. Acree, Jr., James S. Chickos
Quantity | Value | Units | Method | Reference | Comment |
---|---|---|---|---|---|
ΔvapH° | 39.3 ± 0.2 | kJ/mol | V | Good, 1972 | ALS |
ΔvapH° | 39.3 | kJ/mol | N/A | Good, 1972 | DRB |
ΔvapH° | 39.3 ± 0.1 | kJ/mol | N/A | Good, 1972 | See also Osborn and Douslin, 1966.; AC |
Enthalpy of vaporization
ΔvapH (kJ/mol) | Temperature (K) | Method | Reference | Comment |
---|---|---|---|---|
39.3 | 300. | N/A | Dykyj, Svoboda, et al., 1999 | Based on data from 285. to 318. K.; AC |
37.8 | 333. | N/A | Dykyj, Svoboda, et al., 1999 | Based on data from 318. to 441. K.; AC |
37.4 | 343. | A,EB | Stephenson and Malanowski, 1987 | Based on data from 328. to 441. K. See also Osborn and Douslin, 1966.; AC |
Antoine Equation Parameters
log10(P) = A − (B / (T + C))
P = vapor pressure (bar)
T = temperature (K)
View plot Requires a JavaScript / HTML 5 canvas capable browser.
Temperature (K) | A | B | C | Reference |
---|---|---|---|---|
328.96 to 440.50 | 3.96433 | 1354.154 | -57.203 | Osborn and Douslin, 1966 |

Normal alkane RI, non-polar column, isothermal

Column type | Active phase | Temperature (C) | I | Reference | Comment |
---|---|---|---|---|---|
Capillary | DC-200 | 50. | 801. | Leppin, Gollnick, et al., 1969 | Argon; Column length: 100. m |

References

Good, 1972
Good, W.D.,
Enthalpies of combustion of 18 organic sulfur compounds related to petroleum,
J. Chem. Eng. Data, 1972, 17, 158-162. [all data]
Pedley, Naylor, et al., 1986
Pedley, J.B.; Naylor, R.D.; Kirby, S.P.,
Thermochemical Data of Organic Compounds, Chapman and Hall, New York, 1986, 1-792. [all data]
Osborn and Douslin, 1966
Osborn, A.G.; Douslin, D.R.,
Vapor Pressure Relations of 36 Sulfur Compounds Present in Petroleum.,
J. Chem. Eng. Data, 1966, 11, 4, 502-509, https://doi.org/10.1021/je60031a014
. [all data]
Dykyj, Svoboda, et al., 1999
Dykyj, J.; Svoboda, J.; Wilhoit, R.C.; Frenkel, M.L.; Hall, K.R.,
Vapor Pressure of Chemicals: Part A. Vapor Pressure and Antoine Constants for Hydrocarbons and Sulfur, Selenium, Tellurium and Hydrogen Containing Organic Compounds, Springer, Berlin, 1999, 373. [all data]
Stephenson and Malanowski, 1987
Stephenson, Richard M.; Malanowski, Stanislaw,
Handbook of the Thermodynamics of Organic Compounds, 1987, https://doi.org/10.1007/978-94-009-3173-2
. [all data]
Leppin, Gollnick, et al., 1969
Leppin, E.; Gollnick, K.; Schomburg, G.,
Gas chromatographic identification of isomeric mercaptans,
Chromatographia, 1969, 2, 12, 535-540, https://doi.org/10.1007/BF02260096
. [all data]